program: Gaussian 09
title: 000273223
version: EM64L-G09RevD.01
frameworkgroup: C1[X(C13H18O6)]
method: RPBEPBE
basis: SDD
operation: Freq
keyword: #pfreq=noraman
keyword: PBEPBE/SDD
title: #p freq=noraman PBEPBE/SDD
converged: YES YES NO NO
title: Mulliken charges:
elementType: O O O O O O C C C C C C C C C C C C C H H H H H H H H H H H H H H H H H H
charge: -0.209684 -0.259523 -0.270456 -0.222930 -0.193781 -0.216265 -0.000834 -0.412792 -0.325703 0.288829 0.205860 0.253505 -0.508879 0.125789 -0.682654 -0.255512 -0.262726 -0.663037 -0.657578 0.238071 0.266225 0.287930 0.206698 0.227350 0.214839 0.224842 0.255743 0.239379 0.229732 0.226160 0.238547 0.251249 0.229484 0.224036 0.229408 0.257928 0.220747
chargesum: 0.00000
title: Mulliken charges with hydrogens summed into heavy atoms:
elementType: O O O O O O C C C C C C C C C C C C C
charge: -0.209684 -0.259523 -0.270456 -0.222930 -0.193781 -0.216265 -0.000834 0.091504 -0.037773 0.288829 0.205860 0.253505 -0.074831 0.125789 0.012770 0.213600 0.201981 0.041733 0.050505
polarizability: 1.97023778e+02 3.44609025e+00 1.48746428e+02 1.05635094e+00 3.88693921e+00 1.32490472e+02
1716.lowfreq: -4.4836 -2.3215 0.0002 0.0005 0.0008 9.9253 23.3951 24.4538 42.0968
frequency: 22.7581 24.3081 41.9453 45.2876 55.5547 73.1799 77.6617 84.3877 99.1557 127.6851 139.3317 162.0941 187.2816 201.2067 209.1222 218.5534 257.5611 265.3043 300.7755 308.5104 319.6924 327.2451 355.0709 369.4532 421.3561 434.4587 440.7064 520.7811 538.8255 560.8102 601.4946 656.4180 689.3482 736.7420 743.2817 746.4039 768.3095 794.3688 810.0196 814.9142 816.5715 835.6093 888.7606 911.4469 952.0029 971.6813 988.1815 1004.4581 1017.4756 1034.1742 1069.7582 1070.9837 1087.5363 1095.2946 1096.1942 1123.6022 1156.1971 1156.3001 1158.7290 1202.3816 1224.0558 1249.3937 1254.5430 1275.0202 1275.9186 1312.3986 1342.0681 1351.4678 1353.3370 1363.0691 1391.7782 1392.3225 1394.3910 1457.0215 1457.5094 1462.2095 1463.0977 1463.4601 1464.3170 1473.3357 1483.4625 1483.8497 1493.7739 1622.9328 1633.9826 1646.5602 1665.3492 2990.8365 2995.8176 2995.9128 2999.1464 3032.0491 3033.2565 3036.1895 3055.3905 3086.7138 3090.7523 3090.9768 3098.1266 3098.3438 3107.4080 3123.9735 3125.0741 3138.7737 3145.0657
redmass: 3.6746 4.0008 3.6192 3.9760 4.3170 3.6302 3.5376 4.7641 3.7167 3.5068 3.4117 5.6290 2.0825 1.4925 1.7358 1.3151 2.1128 2.8482 2.6760 2.6451 3.4556 4.6611 6.5052 3.6700 4.1568 4.3751 3.9054 5.0902 6.0414 6.2293 4.4969 5.4698 5.2240 3.2615 3.8087 5.0406 3.7136 1.5455 2.3279 1.5524 1.5929 2.8860 1.6291 2.3612 3.0376 4.9449 2.8653 2.4892 3.4847 4.1466 3.6550 1.8774 1.6593 2.2153 2.1699 4.5532 1.6898 1.6619 4.9513 2.9506 2.5958 1.2064 1.4894 1.1226 1.1224 1.4530 1.6715 1.2683 1.2834 1.3205 1.2023 1.2312 1.2267 1.0971 1.0889 1.0854 1.0435 1.0433 1.0823 1.0498 1.0523 1.0518 1.0570 10.1381 10.9600 10.6266 8.8496 1.0356 1.0363 1.0362 1.0592 1.0655 1.0600 1.0596 1.1022 1.1004 1.0973 1.0973 1.1031 1.1030 1.1009 1.1064 1.1070 1.0932 1.1012
irintensity: 0.8099 0.7394 0.0421 2.5700 1.5952 2.8277 0.9707 0.3254 0.2118 1.4392 0.3614 0.0626 6.1254 2.2169 0.5106 2.0536 5.7648 0.9845 7.8103 3.2045 16.3166 8.0934 9.3684 1.0870 0.3095 2.6812 5.8152 6.0260 4.8430 1.4736 6.8068 9.2644 0.5588 9.3762 9.3771 4.6846 15.4704 1.8430 3.1775 9.3188 8.8481 6.3057 16.6301 51.3611 25.2786 52.8552 19.1222 28.0964 149.9704 135.4125 90.5861 1.7216 6.2084 11.2835 49.6533 288.2234 6.3251 4.8292 276.8026 232.6810 17.8356 3.4447 2.9256 5.3426 7.4718 2.0241 4.4960 2.6835 2.0867 5.0663 13.7767 25.7258 23.6801 12.2134 6.0076 23.7333 14.8847 17.7118 3.1586 18.0340 12.5895 15.8250 14.6448 114.5473 217.7069 199.3243 82.0149 35.1284 22.9860 7.5598 25.8961 27.3082 25.0457 25.2544 7.2534 43.0016 24.4587 38.2628 0.8190 1.7245 19.6258 24.2352 26.7302 7.8325 4.0447
temp: 298.150 k
press: 1.00000 atm
elementType: 8 8 8 8 8 8 6 6 6 6 6 6 6 6 6 6 6 6 6 1 1 1 1 1 1 1 1 1 1 1 1 1 1 1 1 1 1
symmnumber: 1
zpe: 770892.3 jmol-1
zpe.correction: 0.293617 hartree
zpe.thermalcorrener: 0.314611 hartree
zpe.thermalcorrenthalpy: 0.315556 hartree
zpe.thermalcorrgfe: 0.241395 hartree
zpe.sumelectzpe: -956.051586 hartree
zpe.sumelectthermal: -956.030592 hartree
zpe.sumelectthermalent: -956.029648 hartree
zpe.sumelectthermalfe: -956.103809 hartree
dipole: 5.9411 -0.6043 -0.4070
dipole: 5.9856
quadrupole: -110.7539 -94.4235 -123.0639
quadrupole: 3.7695 13.0482 -1.4505
quadrupole: -1.3401 14.9903 -13.6502 3.7695 13.0482 -1.4505
hfenergy: -956.3452035 hartree
pointgroup: C01 [X(C13H18O6)]
dipole: 1.5416441 1.7721209 0.1687763 debye
polarizability: 177.4643742|24.100897|167.9082432|-4.1040141|2.488201|132.8880604 unknown
InChI: InChI=1S/C13H18O6/c1-4-9-7-13(8-19-10(9)14,11(15)17-5-2)12(16)18-6-3/h7H,4-6,8H2,1-3H3
charge 0 multiplicity 1
37 atoms
O  -0.816367 -0.89006 -1.820196
O  1.231748 2.470619 -0.530319
O  2.317383 -0.547415 0.091424
O  0.824242 2.109342 1.737176
O  0.692665 -1.69979 1.307711
O  -2.796182 -2.017239 -1.6123
C  0.10723 0.412701 0.095624
C  -0.063631 0.330644 -1.439666
C  -1.260513 0.272555 0.745298
C  -2.265151 -0.4383 0.158397
C  0.753004 1.741418 0.543938
C  1.036901 -0.743443 0.588821
C  -3.616314 -0.651679 0.814538
C  -2.022067 -1.162748 -1.132022
C  -3.720339 -2.037259 1.508384
C  1.897083 3.78001 -0.212015
C  3.33472 -1.6021 0.42198
C  0.860057 4.900397 -0.113491
C  3.231994 -2.773075 -0.557337
H  -0.615702 1.216675 -1.800932
H  0.899165 0.252407 -1.961032
H  -1.387947 0.724497 1.7356
H  -3.787829 0.149723 1.557254
H  -4.411359 -0.577861 0.049352
H  -4.705566 -2.146148 1.996615
H  -2.935079 -2.152663 2.276438
H  -3.608532 -2.848062 0.769642
H  2.458318 3.659957 0.730648
H  2.589453 3.921463 -1.056484
H  4.291845 -1.064294 0.336242
H  3.167857 -1.926151 1.464082
H  0.184404 4.737692 0.742481
H  0.261619 4.968971 -1.038054
H  1.375049 5.867522 0.034601
H  3.340532 -2.428473 -1.599914
H  2.265285 -3.292406 -0.451761
H  4.038528 -3.500126 -0.348524
