program: Gaussian 09
title: 000273222
version: EM64L-G09RevD.01
frameworkgroup: C1[X(C17H13Cl2N)]
method: RPBEPBE
basis: SDD
operation: Freq
keyword: #p
keyword: freq=noraman
keyword: PBEPBE/SDD
title: #p freq=noraman PBEPBE/SDD
converged: YES YES NO NO
title: Mulliken charges:
elementType: Cl Cl N C C C C C C C C C C C C C C C C C H H H H H H H H H H H H H
charge: -0.054578 -0.071027 -0.407298 0.096986 0.328734 0.331686 -0.427206 -0.373304 -0.451501 0.554210 -0.381772 -0.426893 -0.355485 -0.452231 0.678877 -0.250602 -0.238091 -0.298925 -0.353601 -0.610960 0.223822 0.228736 0.248253 0.229291 0.243804 0.259207 0.257915 0.223249 0.223513 0.311185 0.214951 0.250403 0.248651
chargesum: 0.00000
title: Mulliken charges with hydrogens summed into heavy atoms:
elementType: Cl Cl N C C C C C C C C C C C C C C C C C
charge: -0.054578 -0.071027 -0.096112 0.096986 0.328734 0.331686 -0.203385 -0.144567 -0.203248 0.554210 -0.152481 -0.183089 -0.096278 -0.194315 0.678877 -0.027354 -0.014578 -0.298925 -0.353601 0.103045
polarizability: 5.27321424e+02 2.48465698e+00 2.25054482e+02 -6.95320221e-01 1.02652781e+01 8.82312615e+01
1716.lowfreq: -6.4978 -1.4560 -0.0025 -0.0019 0.0015 3.7168 19.7701 21.7477 42.0813
frequency: 19.5013 21.4447 42.0793 61.5704 105.3130 117.7524 141.9139 174.6332 186.4414 198.8565 212.6852 230.9712 237.9057 246.1919 313.3925 322.8588 370.5770 377.8165 397.6898 425.9360 433.6953 478.7137 512.2863 530.6061 557.4339 562.1279 575.7027 600.1591 646.4985 656.3697 707.5655 714.9026 733.3564 745.0587 761.2541 774.8780 799.5514 801.3540 853.3788 864.1091 878.3661 879.2133 909.9320 922.1859 925.7713 943.9080 979.2770 1017.5277 1022.0523 1032.9336 1076.7251 1094.1124 1116.4847 1117.3767 1132.7131 1168.6069 1193.5731 1207.7159 1222.3021 1248.1930 1279.3104 1318.6081 1329.7181 1338.3009 1388.0590 1414.6759 1431.1720 1445.6730 1447.2922 1458.6624 1469.1064 1474.5238 1490.2795 1509.1606 1529.1290 1551.3349 1592.6850 1606.5226 1613.5903 1632.1025 2992.6733 3080.5639 3083.7297 3097.8465 3117.6355 3126.7965 3140.6126 3154.6921 3160.0227 3174.4691 3198.7258 3214.6455 3520.4488
redmass: 4.2282 4.1373 6.0631 6.3439 4.3255 5.7829 7.5536 6.8791 1.1183 3.6228 4.8826 4.7005 7.9596 5.0526 6.6895 4.8722 6.3287 3.4760 5.3750 3.3866 4.0167 4.5167 6.5072 1.2637 5.9072 3.2445 5.7480 3.3944 5.0565 2.7256 6.3778 5.3680 7.0049 2.3307 1.3332 4.7507 2.1429 3.5539 4.6084 1.4055 1.4098 1.4972 4.8145 1.7362 1.4037 1.4443 1.3308 2.6001 3.7223 2.4802 1.7660 2.6844 1.2759 1.3111 1.6792 1.0972 2.1797 1.9982 1.7968 1.7576 1.7431 2.0738 2.1210 2.8005 2.7379 2.6479 3.8602 2.4916 1.5298 3.7496 1.0456 1.9639 1.1825 4.5915 4.2785 1.8526 6.6140 6.6463 7.3239 7.8687 1.0337 1.1021 1.0872 1.1010 1.0860 1.0885 1.0942 1.0919 1.1001 1.0909 1.0932 1.1000 1.0758
irintensity: 1.0034 1.8393 0.0369 0.0518 1.0903 0.0430 0.3374 0.1315 0.4172 1.5228 0.6712 2.2140 0.4890 3.9301 1.2994 6.2850 3.1785 2.0921 5.6260 4.9101 2.3609 5.6256 10.3357 95.8674 8.8535 2.4259 12.2562 1.8439 38.0594 1.1748 11.6525 31.5150 39.3962 18.2428 93.9694 25.0438 23.2553 12.1275 15.0952 17.3283 3.2061 1.5512 7.9074 24.6283 5.5605 6.0109 0.1127 30.3419 24.8471 29.4588 19.8241 4.8456 1.3565 5.8996 11.8937 9.7234 2.1154 69.6568 6.9884 57.1016 11.3248 43.1363 52.2323 63.7619 3.1467 61.7153 48.0603 13.2050 39.8833 146.5594 15.2724 11.1958 2.4518 1.1870 433.2894 63.5457 3.5389 488.3949 44.6214 1.0395 124.7998 27.7685 13.5362 20.9495 4.2431 1.5559 32.1060 0.9007 58.1941 5.3443 0.9249 8.4613 119.6104
temp: 298.150 k
press: 1.00000 atm
elementType: 17 17 7 6 6 6 6 6 6 6 6 6 6 6 6 6 6 6 6 6 1 1 1 1 1 1 1 1 1 1 1 1 1
symmnumber: 1
zpe: 651882.7 jmol-1
zpe.correction: 0.248289 hartree
zpe.thermalcorrener: 0.266079 hartree
zpe.thermalcorrenthalpy: 0.267024 hartree
zpe.thermalcorrgfe: 0.200141 hartree
zpe.sumelectzpe: -1629.080827 hartree
zpe.sumelectthermal: -1629.063036 hartree
zpe.sumelectthermalent: -1629.062092 hartree
zpe.sumelectthermalfe: -1629.128974 hartree
dipole: -3.1920 0.2075 0.1411
dipole: 3.2019
quadrupole: -105.5447 -124.8453 -137.4773
quadrupole: -3.4636 -1.1538 3.1135
quadrupole: 17.0778 -2.2229 -14.8549 -3.4636 -1.1538 3.1135
hfenergy: -1629.3291155 hartree
pointgroup: C01 [X(C17H13Cl2N1)]
dipole: 1.2543558 -0.0387163 -0.1094462 debye
polarizability: 526.2873987|-19.9815834|145.9634866|-5.2694531|-67.9873537|168.3562821 unknown
InChI: InChI=1S/C17H13Cl2N/c1-20-17-15(18)9-11(10-16(17)19)8-13-7-6-12-4-2-3-5-14(12)13/h2-10,20H,1H3
charge 0 multiplicity 1
33 atoms
Cl 4.164339 -2.163056 1.620963
Cl 3.492531 2.157469 -1.987139
N  5.124043 0.138443 -0.514784
C  -3.0638 -0.054789 0.154479
C  -1.656411 0.124127 -0.300739
C  -3.922747 0.561142 -0.818034
C  -0.559193 -0.360544 0.389662
C  -1.741839 0.85702 -1.580492
C  -3.069224 1.106058 -1.884914
C  0.869709 -0.204914 0.137784
C  -3.611784 -0.666005 1.297444
C  -5.322109 0.559367 -0.648062
C  1.445635 0.784201 -0.717143
C  1.779202 -1.066464 0.817648
C  3.778758 -0.030325 -0.245014
C  -5.02097 -0.670212 1.464895
C  -5.867055 -0.063703 0.50307
C  3.164076 -0.98302 0.631407
C  2.825527 0.845355 -0.881115
C  6.279403 -0.670423 -0.101506
H  -0.786841 -0.974855 1.274182
H  -0.897933 1.105774 -2.223446
H  -3.438453 1.608973 -2.781976
H  -2.973981 -1.134968 2.056353
H  -5.979615 1.030305 -1.387642
H  0.819627 1.527902 -1.211377
H  1.389511 -1.825806 1.503446
H  -5.460738 -1.146318 2.348468
H  -6.952408 -0.07654 0.654172
H  5.323613 0.917899 -1.145434
H  7.166841 -0.264354 -0.615656
H  6.458109 -0.625419 0.986366
H  6.16848 -1.729918 -0.389565
