program: Gaussian 09
title: 000273303
version: EM64L-G09RevD.01
frameworkgroup: C1[X(C21H21N3O9)]
method: RPBEPBE
basis: SDD
operation: Freq
keyword: #p
keyword: freq=noraman
keyword: PBEPBE/SDD
title: #p freq=noraman PBEPBE/SDD
converged: YES YES NO NO
title: Mulliken charges:
elementType: O O O O O O O O O N N N C C C C C C C C C C C C C C C C C C C C C H H H H H H H H H H H H H H H H H H H H H
charge: -0.278908 -0.284159 -0.242497 -0.313760 -0.295860 -0.317108 -0.196242 -0.208425 -0.204291 -0.417620 -0.395987 0.023901 -0.147874 -0.539033 0.180172 0.290055 -0.434268 0.293037 -0.474761 0.463395 0.206563 -0.378756 -0.373253 0.393791 -0.226445 -0.228604 -0.505020 -0.373579 -0.292780 -0.232912 0.382923 -0.336177 -0.346199 0.279461 0.312658 0.272217 0.372699 0.425646 0.278381 0.281917 0.241465 0.222454 0.235004 0.268569 0.227551 0.227062 0.308264 0.309972 0.247720 0.246079 0.242987 0.229445 0.290024 0.291110
chargesum: 0.00000
title: Mulliken charges with hydrogens summed into heavy atoms:
elementType: O O O O O O O O O N N N C C C C C C C C C C C C C C C C C C C C C
charge: -0.278908 -0.284159 -0.242497 -0.313760 -0.295860 -0.317108 -0.196242 -0.208425 -0.204291 -0.044922 0.029659 0.023901 0.131587 0.045842 0.180172 0.290055 0.126030 0.293037 -0.010842 0.463395 0.206563 -0.143753 -0.104684 0.393791 0.001106 -0.001542 0.231766 -0.065316 0.017192 -0.003468 0.382923 -0.046154 -0.055089
polarizability: 3.92268542e+02 -3.14637567e+01 3.04284062e+02 2.57300381e+01 -6.70383630e+00 1.68480560e+02
1716.lowfreq: -0.0011 -0.0005 0.0004 2.7612 3.0679 5.3765 9.7661 15.7127 19.5516
frequency: 9.6408 15.5077 19.5362 21.6515 27.5020 37.2815 38.8945 43.1015 45.1802 66.3493 71.3250 75.3308 81.4407 89.9692 100.2919 110.0039 126.2517 132.8628 139.8869 147.4084 172.5896 180.2492 182.5673 220.1366 226.3272 242.1365 243.8992 271.9820 304.6234 313.6397 315.9965 327.2830 337.7409 377.2180 381.4129 405.0070 418.7226 443.9055 463.1769 491.5748 496.1786 508.1353 535.9480 538.1935 554.4240 577.6297 606.6556 617.5486 618.6293 620.4710 667.4992 667.9986 682.6870 689.1210 702.9438 704.4835 708.4281 732.4270 734.2576 748.9228 760.5409 796.0329 816.0901 816.6378 847.3722 856.0196 859.0514 863.4051 872.2255 882.6675 905.0915 936.1446 953.2902 957.8053 973.0997 980.7622 984.5059 990.5705 996.3643 1000.4746 1002.0629 1003.3298 1007.3147 1027.5978 1060.3658 1090.5286 1091.7767 1097.1495 1111.6879 1113.0620 1142.8607 1150.2999 1153.8715 1163.9262 1173.2947 1179.6892 1182.9218 1189.1368 1196.8325 1213.6332 1214.8380 1221.3275 1222.2681 1239.8154 1246.5046 1294.7892 1296.6291 1316.2075 1331.0591 1331.6535 1348.5949 1364.0035 1371.0716 1385.7552 1403.0262 1422.2309 1425.4122 1425.7700 1442.2596 1455.8649 1456.0370 1459.7372 1461.8904 1467.7846 1472.4465 1485.3417 1513.6687 1591.5640 1594.8000 1602.1311 1607.8963 1614.6445 1621.2245 1637.8186 1666.0869 2986.3851 2997.1484 3008.0066 3010.4336 3024.2463 3036.8278 3067.6150 3110.2636 3112.8108 3121.1438 3127.9042 3140.4767 3151.5594 3159.5139 3161.4855 3164.8743 3181.9349 3187.4178 3211.9113 3371.2652 3470.9905
redmass: 6.7814 6.3916 6.6021 5.2257 4.4169 6.7697 5.5711 8.3442 9.2701 4.8437 4.9245 5.6914 6.4088 1.3967 5.4953 4.2085 7.4898 4.4719 7.5502 4.3420 4.0749 5.2822 3.2413 8.1697 8.2723 4.4077 7.4176 8.2950 5.9970 7.2145 5.8269 5.7706 3.4440 7.6436 3.1303 2.8186 3.0471 4.2128 5.2216 4.8858 3.3649 7.2281 5.1557 3.4874 3.3264 5.3035 4.9137 6.5091 6.9138 5.5692 5.1117 6.7998 5.0914 4.9757 2.5803 1.4145 3.4731 2.6564 4.9137 9.6857 2.1601 8.9400 1.5468 2.0267 4.5764 1.2528 1.2493 6.2090 5.0200 1.5390 4.7317 1.5056 5.1134 2.9697 2.0089 1.9695 1.7412 5.2308 1.3196 1.3437 3.0057 3.0694 1.3284 2.2154 5.0060 1.5183 3.2048 5.6375 1.2914 1.2628 4.0061 1.4529 2.4678 2.7979 1.0538 1.4204 1.9337 1.1442 2.1700 1.5687 1.3681 2.8819 6.1500 1.1681 1.8720 1.2780 1.6573 1.2340 1.2592 1.4932 1.2604 8.3665 1.5896 7.9913 11.4628 1.1732 1.4975 2.0958 2.1691 1.0847 1.0513 1.3188 1.0564 1.8097 2.2677 2.2746 2.1124 7.4025 6.1081 7.9039 6.7822 6.0808 7.3668 8.1877 11.3182 1.0603 1.0804 1.0345 1.0588 1.0990 1.0587 1.0997 1.1074 1.1051 1.0858 1.0877 1.0922 1.0963 1.1043 1.0921 1.1016 1.0912 1.0958 1.0956 1.0816 1.0776
irintensity: 0.6207 0.1814 0.6095 1.0119 0.0257 0.2085 0.1688 1.5225 2.3282 0.8793 0.9830 1.1083 0.7802 0.5273 6.7074 2.6949 0.7686 1.1688 3.6452 1.3941 6.8972 0.3764 16.1421 6.0111 3.3906 19.9156 23.8336 0.9841 22.7239 0.1616 15.0701 9.4956 3.8717 4.1198 27.6008 0.0213 0.1644 5.3624 29.6028 1.3490 9.4214 1.3774 7.0004 0.2612 6.3288 14.4879 13.4122 1.4710 0.1414 3.7679 19.3337 24.3562 5.7130 5.1830 16.4585 76.4863 84.1252 24.6301 5.8341 14.5690 55.7797 14.0275 64.5656 65.6127 6.1277 2.5993 0.2321 37.4466 14.3353 104.6236 90.7801 15.1862 2.7078 150.4265 4.6969 84.5180 70.6709 3.2015 0.2785 0.4257 39.5625 4.3062 0.6912 3.7271 49.4319 7.4038 0.6266 221.9285 22.7217 0.0689 173.4460 23.9973 577.1492 35.4833 0.0619 148.8518 175.1854 4.8074 165.6083 35.9376 19.1692 26.3458 301.8142 8.4156 56.2443 3.0256 94.7415 29.0254 2.5655 7.1308 18.9330 86.2348 23.5139 0.8528 18.0495 66.9058 26.9904 59.4049 8.2733 62.2546 18.7406 179.7485 16.1326 787.9630 46.3551 29.8793 331.6977 57.2015 3.0377 176.7907 63.5752 1.0042 218.0857 199.6586 190.7312 27.2296 17.3657 27.7540 4.7651 3.5473 37.3870 2.8601 6.0645 21.8936 3.6132 1.9699 19.8017 27.6565 16.4883 13.8968 20.8437 1.8972 2.3968 3.1071 263.4385 168.4656
temp: 298.150 k
press: 1.00000 atm
elementType: 8 8 8 8 8 8 8 8 8 7 7 7 6 6 6 6 6 6 6 6 6 6 6 6 6 6 6 6 6 6 6 6 6 1 1 1 1 1 1 1 1 1 1 1 1 1 1 1 1 1 1 1 1 1
symmnumber: 1
zpe: 1056590.0 jmol-1
zpe.correction: 0.402434 hartree
zpe.thermalcorrener: 0.434261 hartree
zpe.thermalcorrenthalpy: 0.435205 hartree
zpe.thermalcorrgfe: 0.332028 hartree
zpe.sumelectzpe: -1651.654335 hartree
zpe.sumelectthermal: -1651.622508 hartree
zpe.sumelectthermalent: -1651.621564 hartree
zpe.sumelectthermalfe: -1651.724741 hartree
dipole: -3.7233 -1.1242 -2.0105
dipole: 4.3783
quadrupole: -235.1251 -194.6240 -188.5562
quadrupole: 16.8062 -1.9449 11.7057
quadrupole: -29.0233 11.4778 17.5456 16.8062 -1.9449 11.7057
hfenergy: -1652.0567687 hartree
pointgroup: C01 [X(C21H21N3O9)]
dipole: 1.4194837 0.3218539 0.9212068 debye
polarizability: 390.2934357|46.8316694|238.9103797|2.3522875|-66.418721|235.8293497 unknown
InChI: InChI=1S/C21H21N3O9/c1-31-18(25)11-17(23-21(28)32-13-14-5-3-2-4-6-14)20(27)22-12-19(26)33-16-9-7-15(8-10-16)24(29)30/h2-10,17,22-23H,11-13H2,1H3
charge 0 multiplicity 1
54 atoms
O  5.000625 0.024587 -1.622958
O  1.200375 2.46849 -2.016841
O  0.109334 -0.736242 2.536937
O  -3.271533 0.853451 -1.177594
O  -0.977762 -0.749856 0.489559
O  3.60177 -1.558002 -0.556197
O  -4.002667 2.772694 -2.337652
O  -7.786952 -2.939134 1.180967
O  -9.11845 -1.452921 0.074065
N  2.823765 0.543205 -1.231922
N  -0.740698 1.325024 -1.453196
N  -7.962047 -1.891265 0.445596
C  1.432905 0.304566 -0.851228
C  1.299677 0.218783 0.700443
C  0.618731 1.46521 -1.488403
C  0.032435 -0.456812 1.187212
C  -1.604346 2.351701 -2.035516
C  3.784263 -0.42347 -1.087186
C  6.166324 -0.908465 -1.443222
C  6.885251 -0.664416 -0.133733
C  -3.090173 2.054663 -1.892414
C  7.932404 0.28886 -0.055535
C  6.522101 -1.389736 1.030748
C  -4.509876 0.253301 -0.825561
C  8.604506 0.51888 1.165432
C  7.194248 -1.161635 2.252066
C  -1.070854 -1.400398 3.151188
C  -4.346447 -0.905284 -0.028118
C  -5.786319 0.725122 -1.217979
C  8.236741 -0.207605 2.322301
C  -6.759574 -1.146362 0.002695
C  -5.483114 -1.614852 0.39108
C  -6.922297 0.00761 -0.79264
H  1.085656 -0.659169 -1.273386
H  2.152816 -0.373583 1.077412
H  1.378159 1.221517 1.161083
H  3.022033 1.437815 -1.697053
H  -1.160165 0.509168 -0.979485
H  -1.41181 3.342256 -1.576879
H  -1.387687 2.485948 -3.113644
H  5.785932 -1.941961 -1.512654
H  6.800624 -0.6705 -2.311498
H  8.21783 0.852403 -0.952428
H  5.705186 -2.117622 0.970561
H  9.413185 1.256595 1.215037
H  6.908891 -1.727465 3.146068
H  -3.332793 -1.217655 0.241601
H  -5.887055 1.621335 -1.830595
H  -0.809501 -1.500314 4.212921
H  -1.231126 -2.387382 2.686861
H  -1.970384 -0.776064 3.019323
H  8.759946 -0.033079 3.269365
H  -5.404614 -2.515593 1.004769
H  -7.929167 0.330655 -1.069276
