program: Gaussian 09
title: 000273265
version: EM64L-G09RevD.01
frameworkgroup: C1[X(C18H33N2P)]
method: RPBEPBE
basis: SDD
operation: Freq
keyword: #p
keyword: freq=noraman
keyword: PBEPBE/SDD
title: #p freq=noraman PBEPBE/SDD
converged: YES YES NO NO
title: Mulliken charges:
elementType: P N N C C C C C C C C C C C C C C C C C C H H H H H H H H H H H H H H H H H H H H H H H H H H H H H H H H H
charge: 0.553759 -0.083425 -0.082469 -0.701735 -0.709329 -0.332106 -0.330905 -0.143403 -0.304687 -0.383494 -0.305219 -0.386188 -0.219897 -0.333722 -0.700563 -0.689486 -0.702505 -0.689610 -0.255219 -0.215699 -0.234513 0.250549 0.251915 0.239455 0.241886 0.194655 0.216648 0.195529 0.229887 0.205724 0.181053 0.212991 0.218707 0.202315 0.181855 0.215693 0.217967 0.234916 0.248247 0.229851 0.213378 0.210677 0.224427 0.220147 0.214846 0.228188 0.215022 0.210247 0.228162 0.218405 0.214442 0.227228 0.227053 0.228348
chargesum: 0.00000
title: Mulliken charges with hydrogens summed into heavy atoms:
elementType: P N N C C C C C C C C C C C C C C C C C C
charge: 0.553759 -0.083425 -0.082469 -0.199271 -0.227989 0.079198 0.094511 -0.143403 0.082090 0.048204 0.078951 0.047472 0.015019 -0.085475 -0.046658 -0.030066 -0.049047 -0.028600 -0.027991 0.011354 -0.006165
polarizability: 2.52539267e+02 -2.06809160e+01 2.69951625e+02 -5.66768753e+00 -9.10052546e-01 1.93281479e+02
1716.lowfreq: -4.9489 -1.4170 -0.0009 -0.0005 0.0017 10.1081 17.2701 24.7956 26.4565
frequency: 17.0166 24.3525 25.9498 26.8001 30.0805 35.0669 48.0498 50.3721 70.2120 72.4560 92.0223 100.0202 138.2672 150.7011 159.4299 180.6757 183.7950 204.0483 215.0283 219.8584 231.9211 258.1567 271.0427 278.2651 286.7443 290.7504 315.4858 350.9316 390.3818 396.3360 399.4079 411.7017 474.7080 481.7106 488.9338 491.5143 501.7874 613.8334 669.9417 683.0036 695.9217 703.4608 734.1173 744.9820 755.2163 760.7860 762.3314 768.8626 772.1101 802.5449 803.8903 857.5084 892.2181 893.6915 925.9623 948.4241 967.4617 976.5599 978.8840 979.9572 988.2488 996.8199 1018.5637 1020.6694 1025.9500 1055.3850 1058.0761 1069.6842 1071.2345 1076.0781 1079.2814 1080.1585 1081.0792 1106.0461 1109.0326 1133.6353 1138.0383 1171.7681 1188.9561 1198.2162 1199.7896 1203.1768 1210.1674 1236.6625 1240.5192 1275.3089 1276.8635 1291.8415 1294.1323 1305.1848 1327.3336 1328.3759 1338.1611 1340.0207 1363.7380 1366.8422 1368.5776 1370.2603 1371.2593 1375.4896 1379.3732 1383.2511 1385.6745 1421.8219 1433.0961 1444.7925 1455.3535 1456.6860 1465.7038 1465.9748 1466.9561 1471.6584 1472.2082 1476.3264 1476.6728 1480.4993 1481.2584 1485.9181 1486.7619 1495.5429 1497.2430 1582.0912 1592.8400 2854.4308 2855.3719 2868.1468 2873.0397 2976.0919 2977.6950 2983.1011 2983.1958 2988.1794 2989.3011 2993.5623 2999.7390 3016.5648 3017.2477 3020.4783 3025.6467 3037.5955 3038.8790 3061.6554 3071.2986 3072.0445 3072.3405 3076.2765 3076.5440 3079.4627 3081.0761 3087.8048 3089.8298 3115.3196 3120.9723 3132.6806 3143.0802 3160.5460
redmass: 3.4047 3.3714 3.3604 3.6200 3.6692 3.1064 2.9772 2.4353 2.7616 2.9259 3.0218 3.2915 1.7742 1.9664 1.5524 2.5876 2.4581 2.2291 1.2390 1.1716 2.7025 2.3441 2.0057 1.9924 1.9427 2.1983 4.2143 3.8125 3.0174 2.3250 2.7976 3.9013 3.0617 2.6585 2.7555 2.9285 3.0519 6.4229 5.2251 4.0128 4.2019 1.9353 1.5053 1.9890 1.4289 1.7972 2.0687 1.1459 1.1502 1.1842 1.1876 1.2443 1.9721 2.0167 1.3719 1.6869 2.3819 1.6635 1.5331 1.5508 6.2114 1.3125 3.2748 3.2016 2.7895 2.4790 2.3707 2.3894 2.5176 1.6776 2.0759 2.1023 2.4156 1.6446 1.6688 1.5117 1.5315 1.0547 1.1286 1.8134 2.0320 1.5786 1.3784 1.6869 1.6243 1.1198 1.1298 1.1991 1.1961 1.3510 1.2992 1.3027 1.2396 1.2382 1.3227 1.3046 1.3856 3.7973 1.4205 1.2679 1.2333 1.2560 1.2548 2.0796 1.0872 1.1098 1.0633 1.0677 1.1807 1.5093 1.0973 1.0606 1.0628 1.0569 1.0591 1.0510 1.0554 1.0724 1.0706 1.0757 1.0770 5.8783 5.9367 1.0716 1.0718 1.0702 1.0701 1.0349 1.0350 1.0375 1.0389 1.0579 1.0594 1.0575 1.0580 1.0861 1.0869 1.0872 1.0892 1.1009 1.1008 1.1034 1.0990 1.1041 1.0990 1.0993 1.0989 1.1005 1.1008 1.1004 1.1005 1.0850 1.0867 1.0916 1.0961 1.1015
irintensity: 0.0731 0.1189 0.0831 0.0719 0.1433 0.0105 0.3091 0.0714 0.2798 0.4913 0.1287 0.2795 0.6543 0.2952 0.7090 1.4353 0.8786 0.1211 0.2575 0.2276 1.7035 2.3148 0.4165 3.1313 3.1462 0.5776 4.1656 2.8623 0.5124 2.3595 0.1417 7.0687 10.6281 4.8029 2.0602 4.7960 21.0867 0.0748 0.2343 1.3369 0.2602 46.2567 2.4028 36.7067 23.8723 4.8048 25.8930 7.5791 6.4281 3.1022 7.7731 0.0018 4.6199 1.4997 0.9723 4.7514 17.2493 5.2881 0.8185 1.6727 1.6753 0.0432 6.2674 2.7583 3.9452 12.0951 4.1973 123.1554 46.9908 7.8669 10.4238 6.2586 4.8699 33.1032 28.4556 33.7109 16.9787 0.0820 0.8204 30.4252 18.4427 27.1646 9.8975 7.6631 3.9695 3.1385 5.0373 17.4129 21.7931 3.6513 10.5107 5.2656 14.5364 11.3767 2.1327 5.2860 17.0643 0.4782 10.1172 12.1342 19.9224 24.4120 23.3241 11.6995 4.6385 10.1520 8.4697 11.1967 11.1001 19.5297 6.2024 6.1842 3.1264 1.4252 2.2362 7.4655 9.8989 16.0423 14.9724 1.2970 1.2606 1.0604 4.1325 67.5185 80.5206 91.4835 80.6550 30.6782 29.6385 30.4493 24.6305 45.1376 48.2383 17.8062 13.5889 22.5024 5.7372 27.0634 10.6618 17.4832 17.8345 24.5437 42.9931 14.0484 43.9366 68.8962 84.1261 44.2622 50.2249 45.7645 43.2754 4.4013 0.2173 7.4867 40.7896 35.3657
temp: 298.150 k
press: 1.00000 atm
elementType: 15 7 7 6 6 6 6 6 6 6 6 6 6 6 6 6 6 6 6 6 6 1 1 1 1 1 1 1 1 1 1 1 1 1 1 1 1 1 1 1 1 1 1 1 1 1 1 1 1 1 1 1 1 1
symmnumber: 1
zpe: 1247126.0 jmol-1
zpe.correction: 0.475005 hartree
zpe.thermalcorrener: 0.501307 hartree
zpe.thermalcorrenthalpy: 0.502251 hartree
zpe.thermalcorrgfe: 0.413959 hartree
zpe.sumelectzpe: -1154.720638 hartree
zpe.sumelectthermal: -1154.694336 hartree
zpe.sumelectthermalent: -1154.693392 hartree
zpe.sumelectthermalfe: -1154.781684 hartree
dipole: -0.2032 -0.3805 0.1140
dipole: 0.4462
quadrupole: -132.1912 -130.6031 -140.7557
quadrupole: -3.6820 -2.4974 1.1360
quadrupole: 2.3255 3.9136 -6.2390 -3.6820 -2.4974 1.1360
hfenergy: -1155.195643 hartree
pointgroup: C01 [X(C18H33N2P1)]
dipole: -0.0695068 -0.1544486 0.0461931 debye
polarizability: 255.18374|-21.6759823|267.1702874|-6.182018|-1.3234957|193.4183438 unknown
InChI: InChI=1S/C18H33N2P/c1-5-19(6-2)14-16-21(17-15-20(7-3)8-4)18-12-10-9-11-13-18/h9-13H,5-8,14-17H2,1-4H3
charge 0 multiplicity 1
54 atoms
P  0.118259 0.483914 -1.142957
N  3.989221 -0.567398 0.228128
N  -2.916855 -2.099335 0.290825
C  1.77504 0.546178 -0.163522
C  -0.753876 -0.894638 -0.127154
C  2.691211 -0.653519 -0.489108
C  -2.263309 -0.979012 -0.435236
C  -0.693786 2.030548 -0.397339
C  4.944248 0.374042 -0.407874
C  4.558241 -1.884758 0.607881
C  -2.724965 -3.409704 -0.379959
C  -4.309396 -1.807279 0.717495
C  -0.963995 2.182187 0.987032
C  -1.03046 3.090483 -1.277718
C  6.112227 0.773358 0.513662
C  5.051191 -2.790911 -0.555644
C  -3.068837 -4.613417 0.517424
C  -5.366009 -1.66891 -0.414666
C  -1.554131 3.367429 1.481343
C  -1.616484 4.281064 -0.786161
C  -1.880072 4.422021 0.595522
H  1.573859 0.579307 0.922978
H  2.259566 1.499877 -0.442406
H  -0.601159 -0.742976 0.957634
H  -0.250452 -1.840708 -0.402407
H  2.820421 -0.729569 -1.597764
H  2.190234 -1.586223 -0.165189
H  -2.410505 -1.04851 -1.541794
H  -2.742037 -0.03532 -0.112967
H  4.379529 1.288375 -0.66842
H  5.349974 -0.026061 -1.372087
H  3.781216 -2.424493 1.183122
H  5.394447 -1.710585 1.310268
H  -1.657842 -3.479231 -0.663181
H  -3.304618 -3.480292 -1.335723
H  -4.281637 -0.868368 1.303355
H  -4.629265 -2.599266 1.419941
H  -0.717305 1.37517 1.688101
H  -0.833535 2.979111 -2.350734
H  5.723644 1.160644 1.472071
H  6.783427 -0.077064 0.73109
H  6.721406 1.562224 0.035064
H  4.23393 -3.0189 -1.264508
H  5.872664 -2.316191 -1.122628
H  5.430024 -3.750171 -0.155691
H  -2.516649 -4.546744 1.4717
H  -4.148481 -4.667904 0.746263
H  -2.78907 -5.556793 0.013149
H  -5.094927 -0.861449 -1.119076
H  -5.472174 -2.606037 -0.991182
H  -6.355355 -1.425168 0.015823
H  -1.756528 3.469388 2.553884
H  -1.868572 5.091524 -1.479727
H  -2.335995 5.342059 0.978863
