program: Gaussian 09
title: 000273306
version: EM64L-G09RevD.01
frameworkgroup: C1[X(C18H17N3O7)]
method: RPBEPBE
basis: SDD
operation: Freq
keyword: #p
keyword: freq=noraman
keyword: PBEPBE/SDD
title: #p freq=noraman PBEPBE/SDD
converged: YES YES NO NO
title: Mulliken charges:
elementType: O O O O O O O N N N C C C C C C C C C C C C C C C C C C H H H H H H H H H H H H H H H H H
charge: -0.289577 -0.273782 -0.266282 -0.211350 -0.335155 -0.215690 -0.209343 -0.353577 -0.365412 0.017917 0.489918 -0.490851 -0.521594 -0.475684 0.266426 -0.375935 -0.400149 0.394902 0.240618 -0.287293 -0.355383 -0.223087 -0.229684 0.377659 0.350964 -0.354368 -0.301940 -0.224830 0.248623 0.230876 0.259034 0.260619 0.287072 0.266304 0.364890 0.259933 0.238022 0.337664 0.309127 0.270421 0.232756 0.245093 0.288242 0.288291 0.235595
chargesum: 0.00000
title: Mulliken charges with hydrogens summed into heavy atoms:
elementType: O O O O O O O N N N C C C C C C C C C C C C C C C C C C
charge: -0.289577 -0.273782 -0.266282 -0.211350 -0.335155 -0.215690 -0.209343 0.011312 -0.027748 0.017917 0.489918 -0.011353 -0.001941 0.077692 0.266426 -0.116002 -0.162127 0.394902 0.240618 0.021834 -0.084962 0.009669 0.015408 0.377659 0.350964 -0.066125 -0.013649 0.010765
polarizability: 3.12806988e+02 1.27505320e+01 2.06437258e+02 -3.00650954e+00 -4.26250697e+01 1.86033142e+02
1716.lowfreq: -7.0767 -4.9846 -0.0004 0.0004 0.0005 5.2201 12.5356 20.4422 21.8265
frequency: 10.9299 20.3219 21.4299 29.4758 36.2971 46.4827 54.4889 55.8199 69.7467 75.0856 87.6888 101.1425 119.5628 143.4899 159.0699 174.5487 194.9403 230.0662 242.0283 253.0741 273.8234 307.2280 312.2055 319.4797 347.4003 377.4358 388.8889 402.3216 414.3488 439.5252 474.3859 495.0391 507.5395 517.8474 530.0962 546.0979 556.3059 594.7361 615.2238 617.2017 626.7645 637.0528 664.9440 682.1228 695.9878 705.9268 732.1309 740.0599 746.9241 764.4018 787.0811 798.7866 817.4756 825.5719 841.3010 860.2589 861.5092 869.8256 877.0427 906.6001 940.5521 970.4219 985.4333 986.2264 989.1417 990.4914 995.4347 1001.2710 1006.8973 1021.0107 1027.4103 1089.1571 1093.5877 1095.3451 1110.5071 1113.4289 1150.2478 1159.4778 1176.1949 1189.6469 1193.0721 1212.1980 1223.4075 1225.0931 1241.1949 1252.4613 1259.7147 1286.8938 1290.8422 1331.2084 1337.6376 1341.4819 1351.4285 1358.0341 1386.0036 1403.4882 1423.7040 1425.4692 1441.5856 1443.1470 1461.6230 1469.6711 1483.5443 1487.5631 1528.9850 1591.1484 1593.1328 1607.9642 1612.6904 1614.2539 1643.1293 1648.5580 2990.5563 3018.0980 3040.6077 3066.6115 3114.2985 3118.5966 3120.4039 3128.7420 3140.4117 3152.3729 3167.1165 3175.6236 3180.2313 3195.9533 3215.1636 3366.7529 3575.5356
redmass: 6.2188 6.4211 7.9858 6.4343 9.9548 6.6181 5.5295 6.3449 5.5434 6.5738 5.6411 10.3916 5.5401 8.7706 6.5488 4.3349 7.3553 9.3138 5.3925 3.1655 6.1418 5.0696 6.7652 4.8594 3.0398 4.5286 4.2351 2.8287 3.0234 4.3884 3.6473 3.5990 7.0016 3.3274 4.6045 1.3120 3.8164 4.3714 6.2792 6.2564 5.3395 5.4726 4.7482 7.5158 8.5052 1.9835 5.1153 4.0491 7.9768 2.4257 1.6959 3.1424 3.5175 3.5618 1.2517 3.4873 1.2558 1.7400 4.8779 4.0110 1.5065 1.8553 1.4310 1.3770 2.6740 4.6211 1.3526 2.8738 1.3161 2.8123 2.2186 1.8995 2.8958 3.2446 2.3857 1.8256 2.7079 2.9023 1.0578 1.1208 2.0554 2.0205 5.7044 3.0328 1.1820 1.7500 1.1435 1.6638 1.2761 1.2602 1.2767 1.3238 1.2318 8.4302 7.9485 10.6797 2.5067 1.2798 1.1220 2.1687 1.1409 2.3513 2.1085 1.9903 1.7885 7.3839 6.0866 7.0542 6.4592 7.7299 5.5946 10.2637 1.0624 1.0645 1.0583 1.0975 1.1075 1.0998 1.0891 1.0865 1.0915 1.0963 1.1015 1.0897 1.0912 1.0969 1.0953 1.0836 1.0782
irintensity: 0.1167 0.5126 0.2106 0.1955 3.0806 0.3026 0.6548 0.3999 1.6508 7.9252 0.4641 9.1989 4.2874 4.8968 3.3037 3.2149 2.2516 2.8286 1.0534 14.3304 13.2169 1.9183 0.0753 1.8779 4.5510 1.4558 22.3399 0.0082 0.1068 8.4946 19.0481 6.3997 1.9658 12.6828 8.4402 152.0319 7.8050 18.1341 2.1441 0.9421 2.0627 1.0327 22.0782 39.3866 22.5845 47.9336 7.1420 39.3815 1.4982 55.6605 143.3954 28.2442 11.1057 9.2088 1.1386 51.0328 9.5090 85.4969 117.8122 92.8888 6.8304 4.2479 1.7456 0.7019 9.1695 1.2279 0.0385 4.8639 0.4397 34.9837 2.4917 7.6362 36.8675 44.1916 249.8157 165.8242 435.3356 11.1734 0.3121 5.8257 16.0379 230.5425 246.5328 77.9043 2.7386 135.9143 35.1885 25.7475 2.6795 1.8958 8.8246 5.4299 11.4435 88.7839 0.7801 16.9843 33.3901 30.6425 30.5805 9.3764 12.0723 39.4541 94.8352 207.4951 190.1939 51.7640 2.4778 68.8386 11.7373 50.9066 259.0728 270.9529 34.5493 19.7622 32.4404 6.9825 2.7428 4.2197 9.4252 0.0701 7.0333 17.1755 11.6663 0.2534 1.4549 2.2280 2.9251 211.1265 48.4643
temp: 298.150 k
press: 1.00000 atm
elementType: 8 8 8 8 8 8 8 7 7 7 6 6 6 6 6 6 6 6 6 6 6 6 6 6 6 6 6 6 1 1 1 1 1 1 1 1 1 1 1 1 1 1 1 1 1
symmnumber: 1
zpe: 877065.4 jmol-1
zpe.correction: 0.334057 hartree
zpe.thermalcorrener: 0.359751 hartree
zpe.thermalcorrenthalpy: 0.360695 hartree
zpe.thermalcorrgfe: 0.273274 hartree
zpe.sumelectzpe: -1384.863707 hartree
zpe.sumelectthermal: -1384.838013 hartree
zpe.sumelectthermalent: -1384.837068 hartree
zpe.sumelectthermalfe: -1384.924490 hartree
dipole: -3.7622 3.8425 0.6609
dipole: 5.4181
quadrupole: -187.2074 -162.5562 -160.1245
quadrupole: -4.7068 7.4602 -9.7231
quadrupole: -17.2447 7.4066 9.8382 -4.7068 7.4602 -9.7231
hfenergy: -1385.1977639 hartree
pointgroup: C01 [X(C18H17N3O7)]
dipole: -1.4689723 -1.1259018 1.0575011 debye
polarizability: 224.5632233|2.3309616|296.9544158|33.6302158|-46.8980035|183.7597488 unknown
InChI: InChI=1S/C18H17N3O7/c22-16(10-20-18(24)27-12-13-4-2-1-3-5-13)19-11-17(23)28-15-8-6-14(7-9-15)21(25)26/h1-9,19-20H,10-12H2
charge 0 multiplicity 1
45 atoms
O  -3.210974 -1.531866 0.096116
O  1.301316 -1.079783 -0.029702
O  1.193872 -4.784975 -0.545298
O  3.263451 -0.756208 1.238183
O  -1.97163 -2.434449 1.895777
O  -0.554859 3.977022 -3.396588
O  1.553536 4.668793 -2.865155
N  0.69048 -3.381464 1.254317
N  -1.986818 -3.423684 -0.22398
N  0.598571 3.798508 -2.838292
C  -2.962342 0.813347 0.959263
C  -3.766033 -0.465164 1.01353
C  -1.160531 -4.578938 0.165165
C  2.053986 -2.892443 1.384158
C  0.351176 -4.263112 0.244363
C  -1.841847 0.994453 1.811259
C  -3.335977 1.858671 0.076331
C  1.240469 0.169828 -0.70155
C  2.298888 -1.463225 0.889839
C  2.271306 1.143149 -0.722531
C  0.021451 0.363825 -1.393698
C  -1.106974 2.199992 1.776138
C  -2.601933 3.065559 0.039761
C  0.831381 2.528789 -2.117657
C  -2.35481 -2.462898 0.685292
C  2.055735 2.33413 -1.443458
C  -0.189594 1.55144 -2.108393
C  -1.486408 3.237856 0.892325
H  -3.792605 -0.89083 2.030839
H  -4.786761 -0.325369 0.624714
H  -1.28775 -5.373309 -0.585408
H  -1.511193 -4.951382 1.145311
H  2.699581 -3.562802 0.781273
H  2.408594 -2.933932 2.428931
H  -0.07371 -2.967668 1.811514
H  -1.556479 0.187438 2.495997
H  -4.206657 1.728792 -0.578742
H  -2.309479 -3.328049 -1.187267
H  3.204069 0.979189 -0.183292
H  -0.748587 -0.409898 -1.341582
H  -0.245108 2.334358 2.43914
H  -2.899151 3.868316 -0.643465
H  2.820637 3.114007 -1.48368
H  -1.125461 1.742085 -2.638039
H  -0.919127 4.175102 0.869443
