program: Gaussian 09
title: 000273185
version: EM64L-G09RevD.01
frameworkgroup: C1[X(C8H7IN2)]
method: RPBEPBE
basis: SDD
operation: Freq
keyword: #pfreq=noraman
keyword: PBEPBE/SDD
title: #p freq=noraman PBEPBE/SDD
converged: YES YES NO NO
title: Mulliken charges:
elementType: I N N C C C C C C C C H H H H H H H
charge: 0.013520 -0.442738 -0.065290 0.303883 0.018032 0.310417 -0.362785 -0.331434 -0.905406 -0.206096 -0.228609 0.322073 0.236359 0.252253 0.299367 0.330107 0.227074 0.229271
chargesum: 0.00000
title: Mulliken charges with hydrogens summed into heavy atoms:
elementType: I N N C C C C C C C C
charge: 0.013520 -0.120665 -0.065290 0.303883 0.018032 0.310417 -0.126425 -0.079181 -0.275932 0.020978 0.000662
polarizability: 2.20760047e+02 -3.62394566e+00 1.02957807e+02 5.90579967e+00 -5.93814952e-01 6.96153773e+01
1716.lowfreq: -4.4002 -0.0002 0.0005 0.0006 6.2389 11.7518 43.5148 57.0195 145.3923
frequency: 43.4537 57.0101 145.3906 241.4513 253.4615 304.6152 422.8588 449.6206 499.7950 506.8035 578.4890 601.9917 612.2483 673.6657 711.2156 757.5015 772.4260 819.4258 835.9805 859.7656 887.6516 941.9979 972.0290 980.7244 1007.3328 1089.8126 1113.7266 1159.7806 1177.2063 1217.0049 1223.2534 1263.1029 1311.1473 1368.1278 1412.2666 1426.3075 1439.4214 1478.8573 1515.1186 1590.9690 1632.6656 3078.9230 3133.6477 3146.8941 3161.1364 3175.2333 3178.1089 3590.8826
redmass: 5.0266 8.0554 7.9325 2.9323 4.3977 5.2553 3.3355 3.4744 6.2825 4.8985 3.2600 1.2894 5.4758 5.0455 5.7827 1.3839 3.4950 2.7978 2.1417 1.5206 4.4629 1.3791 5.2938 1.3112 2.1206 1.2623 1.5746 1.1597 1.1665 2.6215 1.5021 2.7942 2.1818 3.6069 2.8350 1.7150 1.8158 3.4454 4.5256 6.8226 7.4278 1.0593 1.0857 1.0905 1.0961 1.0992 1.1083 1.0815
irintensity: 2.4956 1.9747 2.6701 5.6477 11.0238 7.8558 27.8057 1.5793 33.4160 32.1326 10.1248 73.1902 5.9084 16.5473 7.3806 110.3285 8.2121 6.5243 24.2199 0.0808 2.9103 3.9875 3.8080 0.0487 9.1854 15.3567 4.1172 4.9194 68.4036 19.8388 24.4258 12.4231 31.9042 48.1794 5.3980 6.3409 10.5131 1.6641 2.0668 9.0930 5.9461 6.3189 0.4615 9.9626 22.5027 21.1645 0.4980 48.0397
temp: 298.150 k
press: 1.00000 atm
elementType: 53 7 7 6 6 6 6 6 6 6 6 1 1 1 1 1 1 1
symmnumber: 1
zpe: 351824.7 jmol-1
zpe.correction: 0.134003 hartree
zpe.thermalcorrener: 0.143051 hartree
zpe.thermalcorrenthalpy: 0.143995 hartree
zpe.thermalcorrgfe: 0.097041 hartree
zpe.sumelectzpe: -429.303628 hartree
zpe.sumelectthermal: -429.294581 hartree
zpe.sumelectthermalent: -429.293636 hartree
zpe.sumelectthermalfe: -429.340591 hartree
dipole: -1.3657 -2.7382 1.8836
dipole: 3.5932
quadrupole: -74.7214 -75.0199 -78.1303
quadrupole: 3.0552 4.1895 -1.9758
quadrupole: 1.2358 0.9373 -2.1731 3.0552 4.1895 -1.9758
hfenergy: -429.4376314 hartree
pointgroup: C01 [X(C8H7I1N2)]
dipole: -0.5769245 1.1800616 -0.5225688 debye
dipolederiv: -0.7097587 -0.0547736 -0.1248077 -0.2463028 -0.1369751 -0.0737924 -0.6543238 -0.0751286 -0.2951923 -0.4395751 0.0712826 0.0687424 -0.1312828 -0.505947 0.037587 0.0395074 0.0229067 -0.2589369 -0.1355248 -0.1365822 0.0400283 0.1103763 -0.396591 0.013378 -0.1705414 0.0012952 -0.2852011 0.178935 0.1179307 -0.1204094 0.175911 -0.0698801 -0.0765374 -0.0290081 -0.0336302 0.0803079 -0.0138617 0.0328001 -0.0894673 -0.0255671 -0.0424348 0.0510137 0.0564858 0.0072189 0.060889 -0.2859633 -0.1357006 -0.0459478 -0.2596093 0.6693746 -0.0733231 0.2278848 0.0102759 -0.0357245 0.0457092 -0.0944319 0.0022283 -0.0663202 0.0585538 -0.0033864 -0.0424433 0.0271053 -0.1889326 0.2570875 -0.0127319 0.0042093 0.0932991 0.1345139 0.0251427 -0.036819 0.0096849 -0.1346633 1.1501256 0.1928577 0.3701997 0.2645201 0.0673444 0.1490716 0.6842697 0.1276996 0.451918 -0.1202541 -0.0200886 -0.0555477 -0.243998 0.0980652 0.0013949 -0.0121075 0.0143467 -0.1502458 -0.1187267 0.0980041 -0.0449982 0.3749558 -0.0533448 0.0111604 -0.0072585 -0.0124431 -0.1754417 0.1864244 0.0109528 0.0272406 0.0034515 0.1860642 -0.0301725 0.0103027 -0.0354528 0.3352704 0.0722351 -0.0192848 0.0146576 0.0325005 -0.0942739 -0.0052969 0.0148898 -0.0073722 0.1770223 0.0990307 0.0158681 0.0127029 -0.0291775 -0.0610099 -0.0087471 0.0116668 -0.0093326 0.1637081 -0.0501139 -0.0110851 -0.06335 -0.0981895 0.0435117 0.0426586 -0.1141822 0.036155 -0.0839013 0.0579375 -0.0496943 -0.0619047 0.0470111 0.0255213 -0.0515659 -0.0561352 -0.0738637 0.0242155 -0.0802053 0.0879231 0.0362348 0.0894533 0.0399591 -0.018385 0.0443603 -0.019757 0.1553091 -0.0935012 -0.0932464 0.0301888 -0.0910315 0.0375485 0.0098 0.0334517 0.0102921 0.1595994 unknown
polarizability: 217.2824101|14.5376414|102.8654569|16.1024037|9.6961558|73.1853642 unknown
InChI: InChI=1S/C8H7IN2/c9-5-8-10-6-3-1-2-4-7(6)11-8/h1-4,10H,5H2
charge 0 multiplicity 1
18 atoms
I  4.202669 0.55819 1.108251
N  0.790143 1.108907 -0.297177
N  0.787622 -1.1762 -0.359948
C  -0.541173 0.730057 -0.087547
C  -0.524758 -0.709625 -0.140327
C  1.546936 -0.064697 -0.453537
C  -1.725173 1.464551 0.132161
C  -1.726611 -1.437497 0.02665
C  3.00026 -0.069864 -0.705016
C  -2.910094 0.717564 0.298745
C  -2.911848 -0.709452 0.246749
H  1.163772 2.056517 -0.271287
H  -1.736358 2.558533 0.173173
H  -1.718784 -2.530699 -0.012559
H  3.335628 0.64833 -1.466445
H  3.347437 -1.087145 -0.921481
H  -3.854341 1.245018 0.47298
H  -3.85753 -1.244687 0.383114
