program: Gaussian 09
title: 000273213
version: EM64L-G09RevD.01
frameworkgroup: C1[X(C10H16NO3P)]
method: RPBEPBE
basis: SDD
operation: Freq
keyword: #p
keyword: freq=noraman
keyword: PBEPBE/SDD
title: #p freq=noraman PBEPBE/SDD
converged: YES YES NO NO
title: Mulliken charges:
elementType: P O O O N C C C C C C C C C C H H H H H H H H H H H H H H H H
charge: 1.272280 -0.513441 -0.515569 -0.639484 -0.688496 -0.217425 -0.271661 -0.214960 -0.225884 -0.235353 -0.391180 -0.395218 0.502926 -0.654550 -0.659026 0.277829 0.261467 0.206842 0.240891 0.219301 0.221427 0.224217 0.223667 0.206271 0.222426 0.228992 0.202225 0.261972 0.227940 0.310633 0.310940
chargesum: 0.00000
title: Mulliken charges with hydrogens summed into heavy atoms:
elementType: P O O O N C C C C C C C C C C
charge: 1.272280 -0.513441 -0.515569 -0.639484 -0.066923 -0.217425 0.006168 0.046508 0.221849 0.205374 -0.166963 -0.171552 0.502926 0.003139 0.033111
polarizability: 2.17945038e+02 -3.11281520e+00 1.12492571e+02 1.37835442e+00 1.79184588e+00 1.35145581e+02
1716.lowfreq: -11.3076 0.0011 0.0016 0.0019 4.7126 11.6057 13.3433 26.6209 43.2682
frequency: 9.3926 26.5922 43.1043 55.6234 72.2891 80.3916 121.0391 137.4449 154.4392 196.4805 222.3418 238.2830 245.8047 278.1221 291.2585 314.4697 362.6465 393.0370 404.3546 405.5464 406.6118 411.0342 435.4488 489.6985 523.4937 597.6858 630.1164 655.2812 677.4862 733.6248 808.7631 812.1319 816.9885 820.0541 834.8383 865.0971 877.1499 946.4840 970.4538 995.1154 1011.1338 1017.0592 1023.4928 1027.1037 1096.2682 1100.3022 1109.4421 1132.4449 1139.1999 1147.3225 1192.7457 1258.8323 1262.4437 1306.6674 1321.9897 1344.1777 1357.1363 1385.2512 1389.4782 1395.3837 1436.9951 1457.9486 1461.1722 1473.6377 1478.4305 1489.5195 1492.2776 1504.4522 1574.1368 1624.3766 1645.5253 2979.7234 2985.4293 2989.2409 3004.4149 3044.8660 3073.3507 3083.4481 3085.3828 3101.8456 3106.8499 3126.5004 3128.6642 3151.4365 3162.4200 3562.9854 3702.6389
redmass: 3.5086 3.5896 3.4511 2.1564 3.3096 3.0874 3.8667 4.2620 4.0410 2.8518 3.5591 1.3191 1.8226 2.8820 4.5990 3.9429 3.6913 3.3420 1.4034 1.4520 2.9838 1.7829 4.9598 5.8081 2.6190 6.5479 6.9273 6.2266 7.1635 3.3426 1.1188 1.1002 4.6028 1.3548 1.7118 3.3422 3.3507 1.3688 1.3391 3.9199 3.2387 3.1254 2.0175 2.9763 2.1090 2.1909 3.2182 1.2365 1.4672 1.5292 1.1282 1.1369 1.1284 1.3106 2.6573 1.2217 1.2473 4.2796 1.2481 1.2223 4.0881 1.0415 1.0400 1.0731 1.0489 1.0566 1.0837 2.9149 6.8779 4.1750 1.2812 1.0560 1.0364 1.0373 1.0611 1.1067 1.1038 1.0974 1.0981 1.1020 1.1032 1.0885 1.0887 1.0963 1.0963 1.0451 1.1040
irintensity: 1.2536 0.0109 2.1948 1.2931 3.5851 0.5201 0.9723 3.2870 4.9078 14.4097 3.1558 0.6159 8.3012 12.0456 7.2546 0.3338 5.6077 24.0297 63.6617 25.0587 0.3921 202.0340 32.9402 82.3748 16.9021 20.7555 1.3393 175.3916 112.5399 11.6463 5.3108 3.4281 9.5327 7.3290 57.8070 151.6452 144.2706 1.4430 0.0342 10.3870 39.0501 161.2798 37.8450 169.0781 25.2105 10.5661 110.8963 8.3721 3.7620 6.3712 27.5535 1.7473 0.2896 6.9984 73.5829 12.4843 6.6709 10.1364 25.4970 31.0024 0.8828 11.0629 12.4416 1.5845 6.1499 8.9776 10.9984 58.4365 10.6543 147.5201 301.4186 41.1549 25.3171 32.0613 42.3706 10.3307 6.6145 36.0657 36.9371 39.6750 31.7741 11.9804 19.1678 11.4332 5.4102 98.3852 23.2716
temp: 298.150 k
press: 1.00000 atm
elementType: 15 8 8 8 7 6 6 6 6 6 6 6 6 6 6 1 1 1 1 1 1 1 1 1 1 1 1 1 1 1 1
symmnumber: 1
zpe: 653793.6 jmol-1
zpe.correction: 0.249017 hartree
zpe.thermalcorrener: 0.266552 hartree
zpe.thermalcorrenthalpy: 0.267496 hartree
zpe.thermalcorrgfe: 0.200954 hartree
zpe.sumelectzpe: -1011.151009 hartree
zpe.sumelectthermal: -1011.133474 hartree
zpe.sumelectthermalent: -1011.132529 hartree
zpe.sumelectthermalfe: -1011.199072 hartree
dipole: -3.9601 1.4624 -2.0756
dipole: 4.7042
quadrupole: -60.4867 -96.7193 -98.1174
quadrupole: -0.7180 -2.9859 3.0593
quadrupole: 24.6211 -11.6115 -13.0096 -0.7180 -2.9859 3.0593
hfenergy: -1011.4000259 hartree
pointgroup: C01 [X(C10H16N1O3P1)]
dipole: 1.6540487 -0.410757 -0.7215972 debye
polarizability: 216.0805705|14.3113371|114.3034634|-0.7024079|1.2297522|135.1991552 unknown
InChI: InChI=1S/C10H16NO3P/c1-3-13-15(12,14-4-2)10-7-5-9(11)6-8-10/h5-8H,3-4,11H2,1-2H3
charge 0 multiplicity 1
31 atoms
P  -0.939381 0.123762 0.21267
O  -1.444683 -1.409754 -0.481678
O  -1.543409 1.156258 -1.03695
O  -1.466858 0.315201 1.710806
N  5.05624 0.75043 -0.377371
C  0.865077 0.31927 -0.003366
C  1.65861 0.551627 1.146342
C  1.475002 0.232577 -1.27841
C  -1.702695 -2.546241 0.444807
C  -3.005024 1.160583 -1.330519
C  3.050804 0.693673 1.026535
C  2.865838 0.375972 -1.405157
C  3.678073 0.608324 -0.252973
C  -2.70167 -3.470248 -0.250005
C  -3.798904 1.937793 -0.273621
H  1.174567 0.625668 2.126627
H  0.859038 0.062923 -2.167181
H  -0.742926 -3.064652 0.637142
H  -2.097703 -2.154499 1.401466
H  -3.060316 1.64481 -2.320173
H  -3.354584 0.114467 -1.42219
H  3.660302 0.876071 1.919546
H  3.333613 0.312478 -2.394804
H  -2.898075 -4.358219 0.37985
H  -3.657707 -2.947561 -0.426345
H  -2.30589 -3.811795 -1.221943
H  -4.868349 1.97094 -0.556854
H  -3.70825 1.459448 0.716877
H  -3.427098 2.973685 -0.192072
H  5.506408 0.698176 -1.28659
H  5.638352 0.924232 0.436933
