program: Gaussian 09
title: 000273175
version: EM64L-G09RevD.01
frameworkgroup: C1[X(C10H10O2)]
method: RPBEPBE
basis: SDD
operation: Freq
keyword: #pfreq=noraman
keyword: PBEPBE/SDD
title: #p freq=noraman PBEPBE/SDD
converged: YES YES NO YES
title: Mulliken charges:
elementType: O O C C C C C C C C C C H H H H H H H H H H
charge: -0.217254 -0.411896 0.016911 0.093838 0.374609 0.280700 0.164901 -0.434533 -0.324172 -0.371066 -0.796167 -0.819333 0.224779 0.271028 0.218608 0.230843 0.229159 0.229158 0.225037 0.225020 0.231630 0.358200
chargesum: 0.00000
title: Mulliken charges with hydrogens summed into heavy atoms:
elementType: O O C C C C C C C C C C
charge: -0.217254 -0.053695 0.016911 0.093838 0.374609 0.280700 0.164901 -0.209754 -0.053144 -0.152458 -0.107007 -0.137647
polarizability: 1.46037792e+02 -5.19990857e+00 1.35200755e+02 7.18183488e-03 -1.99654936e-05 5.53035365e+01
1716.lowfreq: -0.0007 0.0005 0.0009 3.1986 6.8756 11.9811 87.2028 120.3652 137.5456
frequency: 87.1783 120.3490 137.5414 188.8867 213.0615 218.3557 283.5048 305.9466 309.7070 328.4162 362.7721 441.8485 502.2874 541.6082 568.7386 573.1504 608.8985 625.5411 692.7354 730.6680 751.0756 780.8720 785.0159 906.9144 911.2678 956.4840 995.4615 1037.9019 1043.4289 1047.6556 1069.8913 1107.6382 1156.3742 1197.5086 1236.5339 1260.3091 1274.5804 1336.4124 1393.0587 1398.1964 1407.6461 1419.8127 1463.6954 1468.1271 1477.5555 1485.9139 1506.2758 1582.5149 1593.7740 1649.2253 2975.1478 2982.2565 3051.3598 3062.3960 3080.5127 3084.3668 3114.4514 3140.6836 3250.3141 3582.3754
redmass: 1.5612 2.0138 2.6896 1.1324 3.4254 3.1191 3.6363 3.7020 3.1900 1.1576 4.2407 6.5971 5.3116 4.0969 3.3811 3.7358 5.3189 3.8028 6.4685 6.2281 4.1926 1.3372 1.5875 1.3172 5.3882 2.1050 1.5484 1.4685 2.4494 1.5091 4.0516 2.4879 1.4832 1.7717 2.2676 1.6495 2.5418 3.3109 3.8716 1.2528 1.3508 4.2938 1.0461 1.1796 1.0454 1.1014 3.5335 6.4996 6.5622 7.5176 1.0373 1.0367 1.0976 1.0981 1.0988 1.0983 1.0875 1.0953 1.1000 1.0661
irintensity: 0.1830 3.3482 0.2069 0.8971 4.2187 20.2629 5.4833 1.5295 2.1574 121.1428 4.0324 1.3413 1.6602 0.1072 1.7444 0.7851 1.1631 23.2170 4.6897 3.6472 6.9005 17.2403 57.6106 0.8948 48.1405 23.1951 8.7937 0.2104 11.9864 10.0856 100.1132 100.3565 14.2244 32.1928 6.2173 46.5672 33.9494 25.6467 3.7020 1.3209 16.7230 11.8488 0.1227 31.9940 31.9093 1.7224 66.4811 18.1976 3.7604 18.7774 16.9764 55.9012 9.4697 33.0826 47.1807 1.2843 17.0192 20.8666 0.5263 41.0701
temp: 298.150 k
press: 1.00000 atm
elementType: 8 8 6 6 6 6 6 6 6 6 6 6 1 1 1 1 1 1 1 1 1 1
symmnumber: 1
zpe: 453780.5 jmol-1
zpe.correction: 0.172836 hartree
zpe.thermalcorrener: 0.183740 hartree
zpe.thermalcorrenthalpy: 0.184684 hartree
zpe.thermalcorrgfe: 0.136895 hartree
zpe.sumelectzpe: -536.632622 hartree
zpe.sumelectthermal: -536.621718 hartree
zpe.sumelectthermalent: -536.620774 hartree
zpe.sumelectthermalfe: -536.668562 hartree
dipole: 0.9199 2.1784 0.0002
dipole: 2.3646
quadrupole: -54.5187 -68.3939 -74.0868
quadrupole: -7.8303 0.0013 -0.0003
quadrupole: 11.1478 -2.7274 -8.4203 -7.8303 0.0013 -0.0003
hfenergy: -536.8054577 hartree
pointgroup: C01[X(C10H10O2)]
dipole: -0.2653695 0.8916659 -0.0000916 debye
dipolederiv: -0.6675543 0.158941 -0.0000293 -0.1694753 -0.6421707 -0.0000125 -0.000033 -0.0000067 -0.1095159 -0.9960021 0.6253058 -0.0000577 0.7411891 -0.5627205 0.0000453 -0.0000594 0.0000402 -0.3975955 -0.0095273 0.2744031 0.0000043 0.1499373 0.0706591 0.0000145 0.0000113 0.000051 -0.0253427 -0.216923 0.1864473 -0.0000182 0.257336 0.4457584 0.0000155 -0.0000217 0.000032 0.0302757 0.1272154 -0.2382294 0.000044 -0.0867228 0.054121 -0.0000401 0.0001959 -0.0001956 -0.049501 0.2301759 -0.1033489 0.0000037 0.0017749 -0.1147768 0.0000018 -0.0000762 0.0000232 -0.0792494 1.0418948 -0.5662832 0.000065 -0.6356469 0.5245627 -0.0000409 0.0000717 -0.0000349 0.0516788 0.025084 0.1259994 0.00001 -0.0777352 0.0657787 -0.0000165 -0.0000119 0.0000106 -0.1800854 0.3996592 -0.2575944 0.0000339 -0.1591441 0.1532863 -0.000013 0.0000429 -0.0000191 -0.157802 -0.1278499 -0.0669958 0.0000138 0.2456082 -0.2209635 0.0000305 0.0000058 0.0000181 -0.2173612 -0.0165713 0.0297062 -0.0000025 0.0206303 0.0483932 0.0000467 0.000056 -0.0000223 0.0833162 -0.0488442 0.1041159 0.0000233 0.0323324 0.0374492 0.0000382 -0.0001697 0.0001636 0.0778206 0.0772294 -0.0172321 0.0000032 -0.0387175 -0.1349142 -0.0000079 0.0000016 -0.0000179 0.1539509 0.0504415 -0.0498165 -0.000017 -0.0490304 0.0283845 -0.0000027 -0.0000212 -0.0000115 0.2087621 -0.1401637 -0.039992 -0.0000261 -0.0340647 0.0729504 -0.0000069 -0.0000281 -0.0000167 0.179286 -0.0264691 -0.0652525 -0.0000649 -0.1691018 -0.0773528 -0.0001355 -0.0001053 -0.0000844 0.11532 0.0275499 0.0340527 0.0087547 0.0832028 0.0386217 -0.1139031 0.0639503 -0.104498 -0.0425022 0.027664 0.0340037 -0.008662 0.0832113 0.038416 0.1139878 -0.0638291 0.1045778 -0.0423071 -0.036744 0.0557251 -0.1030389 0.0163762 0.0638904 -0.0538367 -0.137005 0.0003185 -0.046432 -0.0369909 0.0555175 0.1030815 0.0160931 0.0639048 0.0540091 0.1370365 -0.0001154 -0.046064 0.0474822 -0.1401174 -0.0001202 -0.0213124 -0.1395986 -0.000169 -0.0000173 -0.0002049 0.1082885 0.2692434 -0.1393554 -0.0000007 -0.2067404 0.1863205 -0.0000048 0.0000059 -0.0000076 0.3850595 unknown
polarizability: 147.0444428|3.8880062|134.1941047|0.0071404|-0.0007708|55.3035365 unknown
InChI: InChI=1S/C10H10O2/c1-6-3-4-8(11)10-9(6)7(2)5-12-10/h3-5,11H,1-2H3
charge 0 multiplicity 1
22 atoms
O  0.151534 -2.07023 -0.000069
O  2.93668 -1.256494 0.000153
C  -0.541925 0.152985 -0.000085
C  0.574984 -0.730325 -0.000015
C  -0.327265 1.567061 -0.000067
C  -1.731155 -0.708532 -0.000188
C  1.915024 -0.29618 0.000082
C  1.016328 1.998938 0.000042
C  -1.26325 -2.007037 -0.000161
C  2.119798 1.099789 0.000112
C  -3.183393 -0.302931 -0.000258
C  -1.466382 2.570749 -0.000266
H  1.224484 3.075236 0.000073
H  -1.765819 -2.970875 -0.000209
H  3.142193 1.499503 0.000203
H  -3.839936 -1.190302 -0.000898
H  -3.437082 0.300578 0.890478
H  -3.436707 0.301609 -0.890393
H  -2.113235 2.458386 -0.890524
H  -2.114565 2.457282 0.888866
H  -1.076774 3.603246 0.000647
H  3.822364 -0.815356 0.000177
