program: Gaussian 09
title: 000273174
version: EM64L-G09RevD.01
frameworkgroup: C1[X(C10H8O3)]
method: RPBEPBE
basis: SDD
operation: Freq
keyword: #pfreq=noraman
keyword: PBEPBE/SDD
title: #p freq=noraman PBEPBE/SDD
converged: YES YES YES YES
title: Mulliken charges:
elementType: O O O C C C C C C C C C C H H H H H H H H
charge: -0.227289 -0.446820 -0.228198 0.292958 0.058283 0.153168 -0.492166 0.359609 -0.408003 -0.314332 -0.221150 -0.779490 0.104879 0.269373 0.248975 0.278748 0.230986 0.251288 0.235033 0.251294 0.382855
chargesum: 0.00000
title: Mulliken charges with hydrogens summed into heavy atoms:
elementType: O O O C C C C C C C C C C
charge: -0.227289 -0.063965 -0.228198 0.292958 0.058283 0.153168 -0.222793 0.359609 -0.159028 -0.035584 0.009836 -0.041876 0.104879
polarizability: 1.60122178e+02 8.46738541e+00 1.45181269e+02 -1.13312844e-02 -8.20616782e-03 5.14473955e+01
1716.lowfreq: -6.8612 -6.0858 -5.1951 -0.0013 -0.0010 -0.0006 45.4016 107.1400 131.3217
frequency: 45.3975 107.1336 131.3212 135.0495 139.1935 258.4193 263.8550 304.7246 345.5761 392.2956 460.0509 474.9042 543.3839 558.2836 591.9403 606.4700 610.0429 619.7175 717.0315 720.8526 752.9714 803.6660 829.9424 839.5688 886.5217 929.9129 932.5488 985.5770 995.2762 1048.2097 1050.9869 1076.2670 1142.7889 1158.5812 1171.2560 1222.9562 1240.1465 1298.4213 1323.0062 1397.9251 1405.6533 1434.8641 1452.3233 1463.1726 1473.4113 1600.9569 1614.2050 1616.4982 1648.9530 2989.2511 3067.9911 3109.0243 3140.6462 3161.0241 3186.0642 3228.0886 3531.3633
redmass: 10.4058 1.5658 2.4922 2.5891 5.6773 4.1694 3.6871 4.2863 7.0359 6.6824 3.5837 4.2121 6.4309 2.2651 2.2325 4.3089 2.2170 6.1201 5.9175 4.8521 2.1360 1.5612 5.8029 1.6907 6.4400 1.4115 6.8933 1.3466 1.5900 1.4891 2.6129 2.0672 1.7395 2.8328 1.3731 1.7311 3.0512 2.1765 3.7919 2.1744 1.4388 8.1534 1.0429 1.4748 1.7169 6.8502 7.8032 7.7826 8.7386 1.0374 1.0979 1.0986 1.0874 1.0951 1.0955 1.0988 1.0642
irintensity: 1.4559 0.0190 4.0050 4.1027 2.4101 0.0034 0.6122 0.2327 5.8178 0.5563 4.0106 5.6630 5.7273 38.3518 38.0539 42.0029 73.4240 6.9350 16.3669 6.2836 57.7165 0.0276 9.8328 58.4157 66.4688 0.4280 88.7350 1.4700 7.2843 8.1048 146.2586 171.3691 4.7141 18.9780 27.2250 16.1636 5.7157 15.1715 104.3293 19.7136 41.7057 4.8420 16.0518 17.8082 7.1712 7.2506 19.6321 46.9295 265.2152 19.3642 10.7881 11.6621 5.2464 18.6468 3.8320 3.5074 44.5472
temp: 298.150 k
press: 1.00000 atm
elementType: 8 8 8 6 6 6 6 6 6 6 6 6 6 1 1 1 1 1 1 1 1
symmnumber: 1
zpe: 408139.9 jmol-1
zpe.correction: 0.155452 hartree
zpe.thermalcorrener: 0.166398 hartree
zpe.thermalcorrenthalpy: 0.167342 hartree
zpe.thermalcorrgfe: 0.118262 hartree
zpe.sumelectzpe: -610.626369 hartree
zpe.sumelectthermal: -610.615423 hartree
zpe.sumelectthermalent: -610.614479 hartree
zpe.sumelectthermalfe: -610.663559 hartree
dipole: -1.5024 2.2019 -0.0002
dipole: 2.6656
quadrupole: -56.3362 -71.9111 -77.4519
quadrupole: -0.6866 -0.0019 0.0013
quadrupole: 12.2302 -3.3447 -8.8855 -0.6866 -0.0019 0.0013
hfenergy: -610.781821 hartree
pointgroup: C01 [X(C10H8O3)]
dipole: -0.5997057 0.860343 -0.0000936 debye
dipolederiv: -0.9420153 -0.0144858 0.0000446 -0.3088657 -0.4341744 0.0000327 0.0000551 0.0000358 -0.1191424 -1.4500398 0.1002843 0.0002609 0.0072862 -0.2693657 -0.000022 0.0004292 -0.0000655 -0.4325132 -0.6118884 0.0410274 0.0001174 0.0391741 -1.0653984 0.0002245 0.0000892 0.0000224 -0.3171886 0.3425322 0.2685064 -0.0000343 -0.1007671 -0.2778635 0.0000299 0.0000117 0.0000173 0.0341377 0.2286717 -0.1770615 0.0000124 0.6381744 0.3008953 -0.0000456 -0.0000692 0.0000478 0.054809 -0.1753201 0.3033711 0.0000153 0.4308084 -0.5304665 -0.0000058 -0.0000175 0.0000385 0.0017609 -0.1402395 -0.1939655 0.000007 -0.1587134 -0.2974462 0.0000174 0.0000103 0.0000157 -0.2487456 0.7247616 0.0213189 -0.000042 0.0266169 0.5915178 -0.0000536 -0.0001611 -0.0001759 0.0099001 0.1773401 -0.071539 -0.0000208 0.0372914 0.112327 -0.0000255 -0.0000286 -0.0000161 -0.145493 -0.0857466 -0.0056192 -0.0000016 -0.3321075 0.1165782 0.000012 0.0000138 -0.0000278 -0.1358803 -0.274249 0.1465187 0.0000017 0.2269865 0.0617087 -0.000036 -0.0000132 -0.0000334 -0.1728361 -0.0635138 -0.0533831 0.0000051 -0.1946543 -0.0984128 0.0000028 0.0001736 0.0001343 0.0682945 1.8126878 -0.3402443 -0.0004326 -0.4155327 1.5366239 -0.0002332 -0.0004633 -0.0000945 0.2385433 -0.0176737 0.0382648 0.000005 0.0743013 0.0802767 0.0000017 -0.0000005 0.0000026 0.1946507 0.0375802 0.0972438 0.0000004 0.0663946 -0.0370456 0.0000098 0.0000016 0.0000129 0.1615329 -0.0014371 -0.0124606 0.0000067 -0.0237108 0.123194 0.0000066 0.0000054 0.0000193 0.1638971 0.033137 -0.0943129 0.0000153 -0.0803875 -0.081841 0.0000218 0.0000166 0.0000221 0.1626821 0.0547213 -0.0274179 -0.0374489 -0.0505558 0.0142695 0.0871411 0.0162524 0.1181751 -0.0204683 -0.0836106 0.0312929 -0.0000698 0.1147973 0.0378375 0.0000725 -0.0001101 0.0000261 0.125565 0.0547618 -0.0272735 0.0375372 -0.0504597 0.0141679 -0.0871834 -0.016184 -0.1182191 -0.0202584 0.3795401 -0.0300649 0.0000213 0.0539232 0.1026179 0.0000323 -0.0000114 0.0000621 0.3967526 unknown
polarizability: 159.9518525|8.6146628|145.3515943|-0.0112489|-0.0083187|51.4473955 unknown
InChI: InChI=1S/C10H8O3/c1-6-5-7-3-2-4-8(10(11)12)9(7)13-6/h2-5,11H,1H3
charge 0 multiplicity 1
21 atoms
O  -1.061566 -1.128362 0.000344
O  3.382858 -1.019064 -0.000373
O  1.550684 -2.445006 0.000396
C  -0.987787 1.185055 0.000178
C  -0.209542 -0.01365 0.000228
C  1.204499 -0.017715 0.000141
C  -2.380327 0.766452 0.000278
C  -2.397157 -0.613588 0.000364
C  -0.329862 2.437871 0.000042
C  1.833973 1.258089 -0.000006
C  1.082573 2.458289 -0.000047
C  -3.474265 -1.645053 0.000539
C  1.993115 -1.27254 0.000227
H  -3.256699 1.410964 0.00027
H  -0.902441 3.371273 0.000008
H  2.926268 1.288944 -0.000081
H  1.611316 3.416969 -0.000149
H  -3.400765 -2.295833 0.890906
H  -4.464171 -1.161181 0.00005
H  -3.400259 -2.296639 -0.88919
H  3.853357 -1.895275 -0.000424
