program: Gaussian 09
title: 000273225
version: EM64L-G09RevD.01
frameworkgroup: C1[X(C18H27NO5)]
method: RPBEPBE
basis: SDD
operation: Freq
keyword: #p
keyword: freq=noraman
keyword: PBEPBE/SDD
title: #p freq=noraman PBEPBE/SDD
converged: YES YES NO NO
title: Mulliken charges:
elementType: O O O O O N C C C C C C C C C C C C C C C C C C H H H H H H H H H H H H H H H H H H H H H H H H H H H
charge: -0.276507 -0.252861 -0.255966 -0.265547 -0.251797 -0.151216 -0.187542 -0.364460 -0.519364 -0.295742 -0.524476 0.451269 0.238740 -0.351597 -0.446493 0.258007 -0.230215 -0.220766 -0.262056 -0.247946 -0.493904 -0.264880 -0.667018 -0.662642 0.276958 0.229791 0.250783 0.211783 0.258119 0.200454 0.215396 0.261000 0.240602 0.249704 0.234688 0.221127 0.222688 0.225496 0.233526 0.224669 0.232621 0.205183 0.208271 0.221905 0.232719 0.229016 0.248691 0.217950 0.227248 0.250178 0.214408
chargesum: 0.00000
title: Mulliken charges with hydrogens summed into heavy atoms:
elementType: O O O O O N C C C C C C C C C C C C C C C C C C
charge: -0.276507 -0.252861 -0.255966 -0.265547 -0.251797 -0.151216 0.089416 0.116115 -0.049462 0.120108 -0.022874 0.451269 0.238740 -0.101894 -0.211806 0.258007 -0.009088 0.001922 0.196967 -0.023277 0.152171 0.189744 0.028640 0.029192
polarizability: 2.49104787e+02 1.88180995e+01 1.88862946e+02 1.02792910e+01 -1.35281013e+01 2.16272494e+02
1716.lowfreq: -7.3357 -2.3048 -0.0009 -0.0009 -0.0008 5.3876 6.0519 18.0797 19.9813
frequency: -4.3029 17.9571 19.8515 21.4703 25.9084 34.1501 43.9407 53.7450 65.5367 77.9406 83.7484 89.6770 95.7356 108.5900 126.1794 129.9574 163.7649 181.0578 194.1781 211.8240 216.9383 231.5863 242.9388 262.4963 287.9085 305.4379 307.3878 327.7251 342.4894 357.9155 404.9783 412.1278 425.7710 438.5755 454.3095 473.9313 564.0637 585.3841 615.3444 616.7277 656.3621 677.6988 704.0589 714.9317 740.0725 770.0351 783.0023 794.6633 801.1794 813.3894 816.7940 827.7778 858.7079 884.3022 901.0800 914.5961 943.9079 950.2338 982.3355 989.8009 993.5015 1005.1386 1010.5422 1011.1520 1022.8059 1033.0672 1043.7289 1065.9603 1074.5783 1082.1877 1094.9721 1096.7819 1110.8424 1116.5934 1122.6442 1134.9318 1153.2114 1156.0865 1156.5551 1160.6082 1169.1530 1180.7350 1211.7324 1214.2808 1226.7429 1255.8209 1278.3440 1278.8027 1281.7662 1294.3862 1304.7343 1323.7679 1353.4519 1356.5703 1366.0320 1371.3921 1378.6712 1390.2806 1391.2846 1391.7743 1392.6674 1436.7856 1439.7048 1440.8202 1456.6931 1456.9852 1457.7857 1462.8819 1464.4140 1467.0660 1469.9834 1478.0028 1484.6279 1484.6952 1485.0339 1486.7489 1594.1134 1614.3716 1619.6094 1635.6729 2920.3757 2933.1294 2938.6074 2945.3957 2988.8848 2992.6059 2993.3519 2993.5637 2999.6391 3008.1309 3027.8040 3030.0657 3057.2741 3064.6784 3076.8432 3087.9117 3088.4218 3091.9681 3094.6329 3105.0554 3115.1113 3118.1650 3120.6592 3122.1012 3135.3425 3146.4467 3160.3892
redmass: 4.6919 4.7113 4.7861 3.9008 4.3566 4.2630 4.2898 3.1975 3.7315 3.2187 3.3289 3.8746 2.5400 3.0176 3.6999 3.2045 3.9818 2.6843 1.6358 1.3485 1.7597 2.5038 1.8615 2.3975 4.8496 2.4199 2.6242 3.8294 3.7097 3.1744 2.8791 3.2773 5.0807 3.4546 3.3550 3.2124 3.0813 3.4132 3.7622 6.1189 4.6059 4.8377 2.2577 3.7683 1.7908 2.6277 1.4063 2.5929 2.0623 1.7782 1.6077 2.9827 1.2492 4.7321 3.1338 1.4784 3.1295 2.3638 1.3887 3.4092 1.8063 1.8971 2.6938 2.5684 2.3045 2.1076 4.9382 4.7531 2.1132 2.2220 2.2042 2.1721 2.2541 1.3556 2.3904 2.1625 2.0852 1.6390 1.7558 1.6780 1.0587 1.1147 1.4771 1.7634 1.5974 1.4128 1.1243 1.1201 1.2682 1.5000 1.4113 1.3200 1.2759 1.2998 1.7849 1.3910 1.5746 1.2368 1.4366 1.8888 1.4066 1.1934 1.0861 1.9331 1.1007 1.0917 1.0511 1.0445 1.0430 1.0674 1.1953 1.2140 1.2598 1.0956 1.2007 1.1078 6.1046 6.1120 8.2852 8.9324 1.0578 1.0366 1.0679 1.0624 1.0987 1.0364 1.0648 1.0367 1.0975 1.1031 1.0593 1.0597 1.0898 1.0852 1.0968 1.0973 1.0974 1.1035 1.1029 1.0979 1.0853 1.1057 1.1061 1.0871 1.0920 1.0955 1.1013
irintensity: 0.9697 0.3552 0.2122 0.2470 0.8392 0.6856 0.8595 0.1600 0.5327 0.4069 1.5585 1.0537 9.3676 4.0252 3.6043 1.0379 0.2823 0.2708 1.8680 4.4966 3.6851 8.8380 1.4652 1.6047 2.2979 10.4906 11.4981 14.8135 5.9800 2.9377 0.5069 5.1300 2.4163 3.0052 3.3955 16.4642 5.1787 4.7755 7.0394 0.5114 7.7617 9.0363 35.1639 3.0215 66.5559 3.5848 13.3221 15.0889 10.1567 3.2344 3.6899 3.3486 0.5445 26.7404 29.2776 2.7384 10.6326 32.2858 0.1397 1.3389 5.5852 19.8006 72.8924 12.5208 31.5066 19.0026 207.6890 74.5534 10.7126 59.2022 62.4699 23.8463 194.1367 13.0450 57.8761 141.0460 14.0892 12.9233 31.9156 25.2532 0.5237 2.2503 11.3659 6.0857 11.5325 3.8447 0.1860 2.5633 24.5375 51.8670 92.3857 25.4105 2.1769 3.6428 4.6111 12.7437 21.4274 23.8458 7.4416 18.9033 11.9761 1.0321 14.2294 11.2283 11.9554 14.1117 11.4363 13.7288 16.9428 21.9078 12.3543 6.1357 23.8224 7.7733 10.2551 4.2219 0.4318 3.4287 157.6593 143.6442 48.4409 105.5568 23.1894 60.6445 48.7043 19.6590 16.6032 17.8313 20.7456 57.7498 34.8621 24.8363 1.9852 8.5397 11.0148 39.8493 33.4232 0.5173 0.9731 25.8910 4.6008 33.5657 29.8412 0.3774 22.9229 39.4133 25.7531
temp: 298.150 k
press: 1.00000 atm
elementType: 8 8 8 8 8 7 6 6 6 6 6 6 6 6 6 6 6 6 6 6 6 6 6 6 1 1 1 1 1 1 1 1 1 1 1 1 1 1 1 1 1 1 1 1 1 1 1 1 1 1 1
symmnumber: 1
zpe: 1112497.2 jmol-1
zpe.correction: 0.423728 hartree
zpe.thermalcorrener: 0.450034 hartree
zpe.thermalcorrenthalpy: 0.450978 hartree
zpe.thermalcorrgfe: 0.362435 hartree
zpe.sumelectzpe: -1131.091002 hartree
zpe.sumelectthermal: -1131.064696 hartree
zpe.sumelectthermalent: -1131.063752 hartree
zpe.sumelectthermalfe: -1131.152294 hartree
dipole: -0.6592 1.3655 -0.4665
dipole: 1.5864
quadrupole: -132.7378 -138.4813 -129.3929
quadrupole: -5.4589 -7.3790 -3.6135
quadrupole: 0.7995 -4.9440 4.1444 -5.4589 -7.3790 -3.6135
hfenergy: -1131.5147296 hartree
pointgroup: C01 [X(C18H27N1O5)]
dipole: 0.3147854 -0.3859471 -0.3761897 debye
polarizability: 242.3680238|29.2218512|190.0677603|-2.0285461|-0.5004413|221.8044421 unknown
InChI: InChI=1S/C18H27NO5/c1-4-23-17(20)11-12-19(13-15-9-7-6-8-10-15)16(14-22-3)18(21)24-5-2/h6-10,16H,4-5,11-14H2,1-3H3
charge 0 multiplicity 1
51 atoms
O  1.394654 -1.198654 2.925072
O  1.807706 -1.524247 -1.711526
O  -0.095383 -2.637981 -0.951031
O  -4.615906 0.761949 -0.61754
O  -4.171385 -0.216109 1.455207
N  0.077577 0.098995 0.544757
C  1.061333 -1.014967 0.528346
C  -1.326429 -0.270816 0.844546
C  0.551803 1.317914 1.252966
C  1.033614 -1.977742 1.738967
C  -2.31333 0.595707 0.031365
C  1.72344 2.012085 0.564299
C  0.842143 -1.823505 -0.75712
C  1.77866 2.129075 -0.847636
C  2.754747 2.597593 1.339488
C  -3.760635 0.318599 0.397792
C  2.834794 2.83017 -1.469327
C  3.812293 3.303158 0.720433
C  1.67731 -2.209767 -3.038264
C  3.854135 3.424257 -0.687528
C  1.384269 -2.012954 4.140199
C  -6.081829 0.558246 -0.393751
C  2.367613 -3.576052 -3.010136
C  -6.510851 -0.832695 -0.869478
H  2.063799 -0.558824 0.469882
H  -1.562994 -0.184227 1.927755
H  -1.480478 -1.325928 0.56109
H  -0.304386 2.021331 1.280955
H  0.819184 1.09091 2.307297
H  1.768171 -2.800625 1.579687
H  0.028812 -2.434401 1.860946
H  -2.171143 0.432328 -1.050551
H  -2.122502 1.673468 0.206681
H  0.996389 1.646548 -1.444206
H  2.731065 2.495144 2.431663
H  2.866185 2.912832 -2.562079
H  4.603518 3.750281 1.333311
H  2.165851 -1.511331 -3.736024
H  0.60374 -2.305836 -3.278079
H  4.674293 3.968165 -1.170158
H  1.659537 -1.34065 4.967839
H  2.121501 -2.841237 4.07702
H  0.378221 -2.442557 4.33112
H  -6.548729 1.361682 -0.98584
H  -6.297686 0.698647 0.680152
H  3.423958 -3.476936 -2.706161
H  1.85506 -4.259003 -2.312184
H  2.339444 -4.028925 -4.018652
H  -6.23957 -0.987645 -1.927986
H  -6.033466 -1.617715 -0.25951
H  -7.607515 -0.939559 -0.773365
