program: Gaussian 09
title: 000273173
version: EM64L-G09RevD.01
frameworkgroup: C1[X(C10H11BrO3)]
method: RPBEPBE
basis: SDD
operation: Freq
keyword: #p
keyword: freq=noraman
keyword: PBEPBE/SDD
title: #p freq=noraman PBEPBE/SDD
converged: NO YES NO NO
title: Mulliken charges:
elementType: Br O O O C C C C C C C C C C H H H H H H H H H H H
charge: -0.064958 -0.410538 -0.419150 -0.330824 -0.474538 0.385044 -0.437514 0.011579 -0.387931 0.104439 -0.646468 -0.236072 -0.332231 0.162558 0.260648 0.228716 0.330793 0.246231 0.246398 0.232212 0.233204 0.236172 0.274236 0.394577 0.393417
chargesum: 0.00000
title: Mulliken charges with hydrogens summed into heavy atoms:
elementType: Br O O O C C C C C C C C C C
charge: -0.064958 -0.015962 -0.025733 -0.330824 0.014827 0.385044 -0.106722 0.011579 -0.141700 0.104439 0.065346 0.000100 -0.057995 0.162558
polarizability: 1.99301503e+02 4.02470867e+00 1.41900200e+02 1.64747617e+01 5.50925312e-03 7.52126103e+01
1716.lowfreq: -15.2998 -7.4524 -3.7641 -0.0004 0.0006 0.0007 32.8002 44.4937 49.8342
frequency: 32.1033 44.0892 49.8247 106.4437 140.3695 164.6264 202.9488 213.8629 237.1726 272.9607 289.5256 319.5944 364.3528 392.2717 432.6703 473.1192 493.4615 540.1389 543.2725 579.1253 596.0007 623.8425 675.4111 712.3778 758.2423 806.2358 827.2096 854.9784 862.7145 897.8744 913.9018 943.0715 985.9676 999.7043 1046.6975 1074.2063 1091.6277 1128.1744 1172.8944 1178.0458 1192.1377 1233.5275 1236.6281 1260.8795 1307.3442 1320.4641 1335.5790 1389.5394 1394.8718 1415.0555 1439.1389 1453.7563 1458.0955 1460.1407 1473.6747 1572.7802 1596.0476 1636.5278 2979.4543 3010.6519 3012.1306 3069.3088 3074.0955 3093.6059 3110.6712 3130.8641 3157.9402 3179.9684 3527.7039
redmass: 3.8400 6.3719 7.2792 6.6062 8.1713 9.0169 3.5596 3.8849 1.2262 2.8274 4.4779 3.4972 7.8890 2.1204 9.5272 3.6356 5.1223 4.2713 3.5625 2.3421 1.9743 3.5982 4.7559 5.5464 2.1375 2.1050 5.2718 1.0922 2.8455 1.5307 4.0015 1.4039 1.3570 1.4145 2.1344 2.1628 1.8443 2.3933 1.2986 1.2282 1.7289 2.7184 1.3474 2.1101 1.3723 1.8262 1.4746 1.2198 3.3575 2.6651 2.9726 2.6608 1.2092 1.0498 1.0543 5.1306 5.7620 4.7093 1.0377 1.0638 1.0643 1.0957 1.1010 1.0942 1.0963 1.0893 1.0907 1.0983 1.0641
irintensity: 0.6543 0.2149 0.3203 0.2027 1.6541 2.2246 1.1279 0.5605 0.1620 2.5913 7.1693 2.8527 15.5258 3.2068 3.5965 0.8750 36.6777 6.9266 7.6383 63.2218 97.6127 35.5802 25.2530 11.0865 60.4475 26.8023 9.8339 129.2655 0.8270 5.6049 30.3145 0.6048 1.1052 31.3218 62.0833 355.8994 36.3161 23.3710 2.1522 7.6557 69.2966 0.9284 5.2745 65.9797 25.6773 137.0085 21.7446 25.4614 59.4690 112.6826 138.9896 30.4270 12.8152 10.7325 8.1898 66.0601 34.9992 169.9079 15.9839 207.3380 128.3998 19.7983 2.7914 8.6343 17.6472 8.3918 8.1259 8.3441 76.4754
temp: 298.150 k
press: 1.00000 atm
elementType: 35 8 8 8 6 6 6 6 6 6 6 6 6 6 1 1 1 1 1 1 1 1 1 1 1
symmnumber: 1
zpe: 499821.9 jmol-1
zpe.correction: 0.190372 hartree
zpe.thermalcorrener: 0.204051 hartree
zpe.thermalcorrenthalpy: 0.204995 hartree
zpe.thermalcorrgfe: 0.147971 hartree
zpe.sumelectzpe: -625.790667 hartree
zpe.sumelectthermal: -625.776988 hartree
zpe.sumelectthermalent: -625.776044 hartree
zpe.sumelectthermalfe: -625.833068 hartree
dipole: 4.1967 2.4742 0.9212
dipole: 4.9581
quadrupole: -88.4184 -88.3154 -92.3351
quadrupole: -4.8473 0.9705 -1.4017
quadrupole: 1.2712 1.3742 -2.6455 -4.8473 0.9705 -1.4017
hfenergy: -625.9810389 hartree
pointgroup: C01 [X(C10H11Br1O3)]
dipole: -1.4533696 -1.25197 0.3541898 debye
dipolederiv: -0.6638703 -0.282688 0.0919091 -0.2642203 -0.3181184 0.0691144 0.0895851 0.0867187 -0.2456001 -0.4975905 -0.0267441 0.0109539 -0.1225662 -1.1291066 0.0180004 -0.0363033 -0.0288783 -0.3538719 -1.4785687 -0.1342344 0.2135244 -0.3274588 -0.2663988 0.0787411 0.230638 0.0366137 -0.4567939 -0.7645651 0.1016198 0.0819986 0.219297 -1.1239027 -0.0649917 0.1036226 -0.0564871 -0.3735284 -0.0994791 -0.1551817 -0.055761 -0.1680477 0.0040469 0.0128725 0.0358555 0.0787098 0.0154095 0.3157228 0.3008247 -0.0272375 -0.0794289 -0.3658388 -0.0117585 -0.2270598 -0.1557717 -0.0903377 0.9032743 0.4450894 -0.1342312 0.5123038 0.3840823 -0.1449853 -0.034701 -0.1521621 0.2864009 0.2203129 -0.1926565 -0.047831 0.2602002 0.9788836 -0.0294164 0.0043207 0.0947217 0.0804961 0.2086926 -0.020731 -0.0894956 0.1820298 0.1728483 -0.0197292 -0.0911639 0.012297 -0.0953796 -0.7112669 0.1796258 0.1487119 0.6304503 -0.4866827 -0.1427681 0.1984988 -0.059594 -0.0748541 -0.1277033 -0.138579 0.0493838 -0.047016 -0.0497833 0.1140424 -0.0918732 0.1030903 -0.0983983 -0.5388461 0.0558294 0.0616735 0.1360953 0.0619218 -0.0133556 0.1019999 0.0061464 -0.19213 0.1262869 0.0140078 -0.0567671 -0.5249982 0.1963828 0.1060504 -0.0816865 0.0120287 -0.0810528 2.0866689 -0.2675406 -0.3940873 -0.378322 1.3328271 0.1072799 -0.437082 0.1072207 0.3498371 0.0376363 0.0128262 -0.0145753 -0.0205817 0.0219083 0.0939809 -0.0114765 0.0539373 0.0020256 -0.0164093 0.0476941 0.0503602 0.0811787 -0.0368234 -0.0843924 0.0152304 -0.0392853 0.0542956 -0.0232156 0.0257309 0.0636596 -0.0347288 -0.0199569 0.0029114 0.0531566 0.0090235 0.0098493 -0.0221067 0.1025908 0.0479566 0.0906679 0.0465197 -0.0163748 0.0426237 -0.0244039 0.1257959 0.0418328 -0.0154337 -0.1040889 -0.0505586 0.0634714 -0.0815999 -0.1060682 -0.0536457 -0.0477079 0.0517266 0.0921848 0.0178424 0.0893602 -0.0302846 -0.0346686 0.079573 -0.0857861 0.0467657 -0.059114 -0.060231 0.0674737 -0.1107812 0.0046921 0.0693631 0.1342171 0.0627102 0.0647514 0.0682806 -0.0316753 0.016928 -0.0382053 -0.1061149 -0.0106171 0.0283006 -0.005836 0.1615447 0.0120639 -0.0564844 0.0308901 -0.0369457 0.0958798 0.0049581 0.0299818 0.0096101 0.1527057 0.5069623 -0.0142152 -0.0289083 -0.085647 0.4213031 0.0076163 -0.0300268 0.0038078 0.3585663 0.4232747 0.0183713 -0.0002825 0.0879232 0.1482437 -0.0302736 -0.0001625 -0.0147859 0.4012108 unknown
polarizability: 194.9238426|14.1018014|144.888075|-20.4313877|0.5167893|76.6023953 unknown
InChI: InChI=1S/C10H11BrO3/c1-6(11)5-7-3-2-4-8(9(7)12)10(13)14/h2-4,6,12-13H,5H2,1H3
charge 0 multiplicity 1
25 atoms
Br 4.611079 1.43539 -0.248807
O  -0.037914 1.662674 -0.284844
O  -3.929329 0.180611 0.536972
O  -2.533531 2.009924 0.295179
C  2.151733 -0.010882 -0.901869
C  0.774214 -0.576855 -0.58999
C  2.847104 0.552595 0.360504
C  -0.304753 0.306515 -0.290716
C  0.511922 -1.962133 -0.599247
C  -1.615504 -0.212943 -0.01349
C  3.176095 -0.481545 1.438883
C  -0.778112 -2.489984 -0.322158
C  -1.836891 -1.618468 -0.031396
C  -2.687413 0.740804 0.275411
H  2.056595 0.809543 -1.635009
H  2.791119 -0.794398 -1.346845
H  2.282207 1.409636 0.757962
H  1.335104 -2.647218 -0.834872
H  3.693992 -0.015258 2.29311
H  3.818932 -1.284929 1.037733
H  2.237298 -0.937718 1.80874
H  -0.942069 -3.571507 -0.341141
H  -2.841546 -1.993826 0.182576
H  -0.903493 2.163121 -0.075552
H  -4.583039 0.90865 0.717466
