program: Gaussian 09
title: 000273171
version: EM64L-G09RevD.01
frameworkgroup: C1[X(C10H18O2S)]
method: RPBEPBE
basis: SDD
operation: Freq
keyword: #p
keyword: freq=noraman
keyword: PBEPBE/SDD
title: #p freq=noraman PBEPBE/SDD
converged: NO YES NO NO
title: Mulliken charges:
elementType: S O O C C C C C C C C C C H H H H H H H H H H H H H H H H H H
charge: 0.149338 -0.410134 -0.249830 -0.522619 -0.071841 -0.360416 -0.442823 -0.396819 -0.388614 0.154764 -0.630019 -0.337447 -0.674581 0.273076 0.262677 0.219333 0.208004 0.224063 0.213855 0.196013 0.206653 0.196341 0.208123 0.239236 0.292182 0.209416 0.214291 0.375279 0.208395 0.219188 0.214917
chargesum: 0.00000
title: Mulliken charges with hydrogens summed into heavy atoms:
elementType: S O O C C C C C C C C C C
charge: 0.149338 -0.034856 -0.249830 -0.249543 0.190836 0.066921 -0.004906 0.005847 0.015850 0.154764 -0.098601 0.086260 -0.032081
polarizability: 1.66329201e+02 4.49395072e+00 1.22087435e+02 3.42606024e+00 -1.26632737e+00 1.05942916e+02
1716.lowfreq: -19.7037 -10.7833 -0.0015 -0.0011 -0.0011 15.2173 28.1419 48.6297 59.9004
frequency: 26.1226 48.5259 59.7051 77.4366 96.2532 132.3024 138.6827 158.4311 211.0118 222.0873 238.4632 246.0466 293.8766 325.1390 352.3006 377.8281 433.3755 461.7931 489.2351 590.6776 608.4386 688.8613 698.7131 724.5412 756.9516 786.0146 838.7204 845.9313 863.4047 885.0139 899.9155 915.3880 940.7380 990.1527 1033.6151 1045.4957 1053.6365 1056.7915 1066.1810 1095.1596 1099.6690 1108.7813 1128.0172 1194.0105 1209.6051 1218.3408 1222.0535 1248.8629 1254.9171 1268.5114 1275.4112 1286.5381 1306.7221 1321.9608 1328.2420 1337.1035 1337.6490 1344.2744 1365.9481 1388.7239 1461.7571 1463.0555 1465.0548 1468.3993 1475.0738 1476.3635 1477.4409 1488.3377 1650.7495 2972.2937 2974.8976 2975.8986 2980.2780 2981.2710 2986.9940 3008.7249 3018.2162 3031.0163 3035.0284 3035.3613 3040.5355 3053.3666 3059.5587 3072.7566 3077.0899 3094.4552 3507.0084
redmass: 3.9014 3.9445 5.0009 1.8089 3.1447 3.0780 7.7805 3.2156 4.5550 1.1308 3.3199 2.9762 2.4933 2.4918 4.1251 6.0365 2.8376 3.6901 2.0332 1.5466 2.7556 3.9607 4.0806 3.6226 1.0771 1.9220 1.9422 2.2727 1.1709 1.5887 1.9656 2.7045 2.4639 2.8499 2.0393 2.1833 1.3337 1.5634 1.6550 1.6834 2.2004 2.1858 2.1479 1.3027 1.4429 1.4104 1.3572 1.2705 1.3777 1.2556 1.2614 1.1069 1.3959 1.3314 1.3483 1.4080 1.4211 1.4876 1.8253 1.2055 1.0873 1.0868 1.0857 1.0827 1.0926 1.0423 1.0519 1.0821 8.1911 1.0639 1.0621 1.0353 1.0632 1.0627 1.0601 1.0582 1.0836 1.0864 1.1006 1.0960 1.1003 1.1012 1.0999 1.1013 1.0996 1.1077 1.0638
irintensity: 0.5200 0.7317 2.3484 0.3520 0.2724 2.3120 0.3954 0.3442 0.2721 0.1098 2.1046 0.2684 0.2694 1.2907 6.0370 2.0054 0.5169 15.3045 6.5740 72.3316 42.8054 15.0577 57.6973 10.4724 8.4522 0.4177 9.3353 3.0105 0.1511 9.6865 14.0704 3.3573 6.5580 62.3316 70.5445 1.3324 21.0016 65.1725 51.8786 30.6084 10.8982 3.7347 15.1853 13.4992 1.4931 1.3432 2.0591 4.4312 1.7716 2.3768 2.0199 0.8133 17.6250 10.3221 3.9044 0.4879 0.4945 0.1179 41.9636 12.5171 5.3207 10.1974 2.5283 19.0107 5.1510 12.9220 3.0043 13.1139 192.2505 33.0191 39.2273 35.6611 36.2311 1.2177 17.4818 27.6937 0.8623 14.9500 4.6792 58.3630 45.5780 9.3495 74.4052 38.4710 48.9805 34.7280 21.5623
temp: 298.150 k
press: 1.00000 atm
elementType: 16 8 8 6 6 6 6 6 6 6 6 6 6 1 1 1 1 1 1 1 1 1 1 1 1 1 1 1 1 1 1
symmnumber: 1
zpe: 695923.3 jmol-1
zpe.correction: 0.265063 hartree
zpe.thermalcorrener: 0.280030 hartree
zpe.thermalcorrenthalpy: 0.280974 hartree
zpe.thermalcorrgfe: 0.221740 hartree
zpe.sumelectzpe: -939.338525 hartree
zpe.sumelectthermal: -939.323559 hartree
zpe.sumelectthermalent: -939.322615 hartree
zpe.sumelectthermalfe: -939.381849 hartree
dipole: -1.3069 0.0227 0.8054
dipole: 1.5353
quadrupole: -79.8715 -82.5283 -91.9094
quadrupole: 1.5824 -0.2508 -3.4618
quadrupole: 4.8982 2.2414 -7.1397 1.5824 -0.2508 -3.4618
hfenergy: -939.6035883 hartree
pointgroup: C01 [X(C10H18O2S1)]
dipole: -0.4692622 -0.2081286 0.3183537 debye
polarizability: 159.1926765|16.8057686|129.2695877|2.9690463|2.4548038|105.8972877 unknown
InChI: InChI=1S/C10H18O2S/c1-2-7-13-9-6-4-3-5-8(9)10(11)12/h8-9,11H,2-7H2,1H3
charge 0 multiplicity 1
31 atoms
S  1.47787 -0.455675 -1.236061
O  -1.459992 2.342785 -0.454435
O  -0.025329 1.569247 1.193708
C  -0.003895 -1.049419 -0.175811
C  -1.177369 -0.049915 -0.293992
C  -0.422839 -2.465587 -0.620403
C  -2.431328 -0.557162 0.494871
C  -1.668097 -2.964045 0.155262
C  -2.843401 -1.968879 0.022332
C  -0.788217 1.320728 0.230399
C  2.705732 0.03298 0.133502
C  3.947134 0.683547 -0.50064
C  4.983852 1.089835 0.572221
H  0.362714 -1.061289 0.867439
H  -1.457429 0.060172 -1.358369
H  0.429457 -3.154971 -0.479458
H  -0.646229 -2.45434 -1.706609
H  -3.262757 0.159324 0.358842
H  -2.188569 -0.583992 1.576205
H  -1.411274 -3.084576 1.227876
H  -1.964179 -3.962893 -0.218166
H  -3.171106 -1.923143 -1.036372
H  -3.712011 -2.317663 0.613192
H  2.978275 -0.882196 0.689073
H  2.180826 0.731603 0.806153
H  4.410295 -0.018585 -1.221305
H  3.635901 1.575903 -1.07742
H  -1.211044 3.220828 -0.055123
H  5.334711 0.209342 1.142672
H  5.866478 1.565774 0.107514
H  4.549619 1.808161 1.292303
