program: Gaussian 09
title: 000273167
version: EM64L-G09RevD.01
frameworkgroup: C1[X(C6H4BrCl2NO2S)]
method: RPBEPBE
basis: SDD
operation: Freq
keyword: #p
keyword: freq=noraman
keyword: PBEPBE/SDD
title: #p freq=noraman PBEPBE/SDD
converged: YES YES NO NO
title: Mulliken charges:
elementType: Br Cl Cl S O O N C C C C C C H H H H
charge: 0.063109 0.114664 0.117430 0.946376 -0.484333 -0.484782 -0.364884 -0.085457 -0.218002 -0.216957 -0.150726 -0.150930 -0.210283 0.294108 0.292972 0.268879 0.268817
chargesum: 0.00000
title: Mulliken charges with hydrogens summed into heavy atoms:
elementType: Br Cl Cl S O O N C C C C C C
charge: 0.063109 0.114664 0.117430 0.946376 -0.484333 -0.484782 -0.364884 -0.085457 0.076105 0.076014 0.118154 0.117887 -0.210283
polarizability: 2.43827863e+02 -9.67392688e-01 1.44337982e+02 -6.94782855e+00 3.62823164e+00 9.73080820e+01
1716.lowfreq: -5.2543 0.0010 0.0012 0.0026 2.0577 3.8504 9.1614 30.4832 39.8174
frequency: 8.8924 30.4769 39.8051 86.4644 105.0093 123.7318 134.2266 181.1075 182.0224 233.0632 243.5134 266.5959 314.0378 344.1758 355.9647 407.2269 408.0627 458.2595 505.2232 574.9264 594.6146 607.9746 684.6810 704.7664 808.8305 832.5181 835.9227 938.7194 967.3477 973.7496 980.1939 1042.3347 1054.5399 1109.3342 1182.4730 1285.9423 1374.7954 1378.6264 1445.1176 1558.6859 1584.1302 3160.6768 3160.9053 3180.1812 3182.8085
redmass: 30.1992 21.8163 4.3210 10.0047 13.6900 16.3681 23.5342 17.7986 18.5759 7.9705 12.6825 12.5546 14.9609 11.8050 6.2126 2.9250 9.8687 12.8305 3.5514 16.0427 16.3389 7.1051 6.9591 4.0977 17.6567 1.2416 1.4283 19.0836 1.3353 7.4511 1.3750 5.0601 2.0648 1.3513 1.1251 1.2299 4.7112 4.2411 2.0461 6.0414 8.0729 1.0900 1.0897 1.0965 1.0976
irintensity: 0.1136 0.1028 0.0067 1.1788 2.6131 1.2997 3.6702 0.4137 2.0127 0.2920 4.5676 1.0221 14.7695 55.7852 0.6358 0.2801 12.8651 58.0878 82.9962 102.6623 41.5514 0.5352 32.2942 1.9807 76.2786 0.2039 51.5105 40.0183 0.0619 53.4237 0.0092 79.6403 22.6358 5.7202 12.5471 1.3288 2.8157 21.3011 50.3021 64.0375 0.4680 3.2229 3.1882 0.0415 3.2758
temp: 298.150 k
press: 1.00000 atm
elementType: 35 17 17 16 8 8 7 6 6 6 6 6 6 1 1 1 1
symmnumber: 1
zpe: 237055.9 jmol-1
zpe.correction: 0.090290 hartree
zpe.thermalcorrener: 0.104734 hartree
zpe.thermalcorrenthalpy: 0.105678 hartree
zpe.thermalcorrgfe: 0.044062 hartree
zpe.sumelectzpe: -1766.676607 hartree
zpe.sumelectthermal: -1766.662163 hartree
zpe.sumelectthermalent: -1766.661218 hartree
zpe.sumelectthermalfe: -1766.722834 hartree
dipole: -3.6366 0.1985 -1.6408
dipole: 3.9945
quadrupole: -110.7119 -99.9726 -114.4691
quadrupole: 0.7304 -6.6321 1.5771
quadrupole: -2.3274 8.4119 -6.0845 0.7304 -6.6321 1.5771
hfenergy: -1766.7668966 hartree
pointgroup: C01 [X(C6H4Br1Cl2N1O2S1)]
dipole: 1.4509012 0.5739898 -0.187768 debye
dipolederiv: -0.8288647 -0.1113653 -0.0042771 -0.161385 -0.027368 -0.0120061 0.021667 -0.0081942 -0.0212795 -0.2726551 -0.0013942 -0.3960196 -0.0879569 0.0146971 -0.2499529 -0.4236963 -0.0557233 -0.6572335 -0.5248093 0.3875317 0.3000855 0.2983289 -0.1496286 -0.1686882 0.3866506 -0.3252107 -0.2686011 1.7594896 0.0930458 0.0492511 -0.1452792 1.1444882 -0.2246493 0.1560858 -0.193017 0.8324043 -0.6352964 0.010929 0.0132068 0.1024175 -0.6844375 0.0342129 0.0480167 -0.1181891 -0.3139295 -0.6084864 -0.0479357 -0.0350212 -0.0008937 -0.4182144 0.0885997 -0.1255054 0.2251703 -0.6075276 0.5839374 -0.4491472 0.1122397 -0.2334518 0.055853 0.4386856 0.029953 0.3916495 0.8735877 -0.1469268 -0.0424394 0.0161626 0.0498234 -0.2070578 0.0742267 -0.0324655 0.0668052 -0.1053635 -0.021224 0.0988795 0.0743088 -0.1252725 -0.0533655 0.0388309 -0.3912734 -0.0059799 -0.0676957 -0.0614746 -0.0046726 -0.1263455 0.2462371 -0.0628868 -0.0002657 0.327325 0.0423919 -0.0142448 -0.5006228 -0.144029 -0.18069 -0.1515449 -0.0777067 -0.0081445 -0.0688971 0.0192937 0.0102274 -0.5380687 0.0259027 0.1590242 -0.0724278 -0.0268849 0.0617643 0.1009418 0.042383 -0.0035796 1.5346164 0.2586493 -0.0223279 0.3368992 -0.0245959 0.0844239 -0.0612467 0.0783993 0.0476419 0.11273 -0.0532989 -0.0422709 -0.0021541 0.1235835 -0.0352937 -0.029943 -0.0164552 0.0951895 0.0983126 0.0041126 0.0703434 0.0219659 0.132364 -0.0047297 0.0236319 -0.0300306 0.0986614 0.0184155 0.0104091 0.0518077 -0.0191862 0.1390925 -0.0492226 0.0574642 -0.050239 0.0485275 0.0309272 -0.0351773 -0.0394775 -0.0561199 0.1220681 -0.0677912 -0.0187085 -0.0630537 0.0532151 unknown
polarizability: 242.9398066|-8.6500256|105.325952|9.5925419|17.407185|137.2081684 unknown
InChI: InChI=1S/C6H4BrO2S.Cl2N/c7-5-1-3-6(4-2-5)10(8)9;1-3-2/h1-4H;
charge 0 multiplicity 1
17 atoms
Br 4.846842 0.582889 0.052745
Cl -3.149867 0.549231 -2.289412
Cl -3.571532 1.8167 0.477283
S  -1.60241 -0.759242 0.246871
O  -1.908741 -2.004285 -0.758156
O  -2.102721 -0.73826 1.796767
N  -2.29892 1.143829 -0.725895
C  0.234495 -0.369532 0.189713
C  0.963575 -0.793332 -0.934209
C  0.797876 0.32523 1.273359
C  2.346685 -0.509285 -0.969693
C  2.181436 0.606206 1.22992
C  2.934646 0.189727 0.108819
H  0.479107 -1.34619 -1.744969
H  0.18849 0.61961 2.133425
H  2.950782 -0.828613 -1.822942
H  2.659455 1.139318 2.055873
