program: Gaussian 09
title: 000273313
version: EM64L-G09RevD.01
frameworkgroup: C1[X(C20H21N3O8)]
method: RPBEPBE
basis: SDD
operation: Freq
keyword: #p
keyword: freq=noraman
keyword: PBEPBE/SDD
title: #p freq=noraman PBEPBE/SDD
converged: YES YES NO NO
title: Mulliken charges:
elementType: O O O O O O O O N N N C C C C C C C C C C C C C C C C C C C C H H H H H H H H H H H H H H H H H H H H H
charge: -0.276297 -0.291809 -0.453430 -0.295300 -0.341557 -0.232231 -0.206564 -0.213372 -0.372516 -0.346628 0.026464 -0.248631 -0.395578 0.265794 -0.496413 0.397667 -0.368692 0.338311 -0.485548 0.309452 0.489396 -0.361051 -0.355749 0.361772 -0.360315 -0.330347 -0.387605 -0.372265 -0.224639 -0.227700 -0.230856 0.276480 0.237402 0.219959 0.359474 0.370363 0.255940 0.281659 0.249542 0.261459 0.232053 0.247279 0.246750 0.283936 0.377601 0.287608 0.299565 0.243637 0.263191 0.231571 0.228871 0.231901
chargesum: 0.00000
title: Mulliken charges with hydrogens summed into heavy atoms:
elementType: O O O O O O O O N N N C C C C C C C C C C C C C C C C C C C C
charge: -0.276297 -0.291809 -0.075829 -0.295300 -0.341557 -0.232231 -0.206564 -0.213372 -0.013041 0.023734 0.026464 0.027849 0.061783 0.265794 0.041186 0.397667 0.142309 0.338311 -0.006217 0.309452 0.489396 -0.114302 -0.071813 0.361772 -0.072707 -0.030782 -0.143969 -0.109074 0.006932 0.001171 0.001045
polarizability: 3.22182381e+02 1.79411776e+01 2.86095406e+02 3.16261310e+01 1.57000077e+01 1.85077922e+02
1716.lowfreq: -7.6682 -0.0007 -0.0002 0.0003 0.9482 5.3652 8.1731 15.5064 18.1165
frequency: 6.9160 15.4916 17.9140 26.3449 29.2306 33.3939 36.8104 39.6154 48.0674 70.4367 74.7444 85.3769 97.2872 106.7928 121.8351 140.3831 154.3839 167.1793 178.2061 190.8642 208.7982 233.6201 252.5448 270.6297 273.9983 279.8508 300.0261 316.1685 333.5255 357.9329 371.7470 404.1005 409.6793 415.4858 439.0098 471.5455 484.6681 508.6796 515.2218 535.6827 577.2457 594.0175 612.0022 617.3775 618.9963 627.1918 638.0985 660.5970 667.3108 690.7508 695.6657 698.6814 705.3778 719.2850 755.1971 761.6386 763.0898 792.6860 816.2664 817.2387 832.8585 839.2127 858.6493 860.6335 862.7010 868.5592 907.8062 937.1012 947.6464 965.0006 972.3946 978.9159 983.6914 990.2677 996.1871 1001.3466 1001.9492 1005.8309 1012.1479 1013.4898 1027.5573 1047.0537 1091.8964 1093.0551 1096.7986 1111.3443 1115.2041 1174.5481 1174.8917 1180.4853 1189.6130 1194.6641 1202.7521 1204.2120 1218.2399 1223.9738 1224.5660 1238.3359 1247.8303 1273.3786 1291.4150 1294.2740 1331.3982 1332.1642 1341.8670 1342.5011 1347.8237 1354.7932 1368.1555 1386.2733 1387.0009 1405.9359 1418.7195 1427.3065 1443.6048 1455.6463 1458.8493 1461.4516 1469.2260 1482.8080 1485.9958 1533.7702 1592.5545 1596.0249 1597.4178 1614.0552 1615.0248 1621.5528 1643.8023 2992.6553 3001.8646 3019.8831 3024.9430 3040.4999 3052.6478 3086.4385 3090.9634 3114.8981 3123.0217 3128.7448 3136.5425 3140.7529 3152.0010 3166.3367 3182.0868 3184.1237 3200.0458 3348.1415 3436.6331 3518.1002
redmass: 7.0176 6.2370 5.3714 5.5250 6.2330 9.2198 4.6450 7.3773 6.9781 6.0251 8.6535 7.1641 5.7617 6.9342 6.9268 4.7201 5.7773 3.9459 5.5947 4.5006 11.4024 4.1160 5.6841 5.0122 5.5920 4.8103 3.8740 4.2080 4.4677 3.1781 4.4783 2.8144 2.9385 5.5059 4.5384 3.4575 4.4106 6.8906 4.6929 3.8314 4.1483 3.3461 1.3952 6.2660 5.3280 6.3676 4.0603 4.5150 4.9333 1.2387 6.0497 5.7931 1.8958 3.5462 2.4550 6.8652 2.7763 1.6230 3.7661 5.1165 2.7553 1.5858 1.5781 1.8448 2.9580 1.9525 3.2141 1.4774 2.5012 8.1681 1.8100 1.4795 1.4305 5.3714 1.6010 1.3519 3.3716 2.6741 1.7748 2.2714 2.2172 3.2976 1.5595 3.1525 2.8036 1.3176 2.1884 1.0880 2.8643 1.5160 1.1539 1.5463 1.5090 1.1532 2.1673 4.3558 3.5361 1.1590 2.0374 1.2190 1.8439 1.3024 1.5273 1.2565 1.4598 1.6186 1.3300 1.2999 4.7839 7.9597 1.1965 6.8835 3.0189 1.1276 2.1750 1.3981 1.0883 1.1134 1.5504 2.5260 2.2854 1.8464 7.5071 6.4470 7.9221 6.2355 6.0492 5.3944 10.8065 1.0587 1.0652 1.0824 1.0597 1.0582 1.1035 1.1022 1.1019 1.1082 1.0870 1.0874 1.0908 1.0920 1.0965 1.1016 1.0894 1.0946 1.0956 1.0835 1.0646 1.0780
irintensity: 0.7932 0.3072 0.0721 0.1911 0.3861 3.0853 0.1686 1.5440 0.0648 0.0997 4.5029 2.8598 11.8086 1.1726 9.6140 1.8573 4.8779 1.2268 1.8808 8.1551 3.0076 2.8026 3.1044 3.2345 11.9233 9.0800 6.1721 10.0429 8.0544 6.0954 28.7725 0.1357 0.2945 7.2646 4.6867 10.0414 12.8032 2.3746 8.3642 1.2273 22.2962 17.1578 97.8261 0.1453 7.5214 5.9997 4.2946 31.9159 18.5073 293.7871 18.5864 5.6943 67.4114 13.3618 58.6842 16.4994 32.7599 99.0022 12.6396 36.4601 33.7330 45.9516 23.9870 29.8936 31.5135 12.5063 12.6089 4.8154 32.0167 98.2713 12.0464 8.4017 1.7318 4.0250 0.9443 2.1886 113.7104 8.4686 3.8508 5.0436 3.5576 34.1358 6.6598 12.4949 63.0006 18.9747 98.4323 10.6340 204.7763 199.8252 30.0841 118.5798 36.2407 3.2255 23.9804 91.4190 133.6468 10.6755 84.6061 17.5314 82.8409 0.3412 15.4569 2.5323 25.4934 11.0963 2.4767 22.2361 113.3143 1.5214 54.1650 3.2158 49.2516 15.5688 10.3371 161.8089 29.9528 18.1276 260.3812 5.5072 19.7518 230.4963 17.1009 3.0924 7.3032 84.7366 3.9683 283.9410 230.5654 9.5350 32.4996 29.6949 12.4628 25.9479 8.1948 1.0377 20.9738 3.5532 4.6531 0.6857 9.1435 13.9916 25.8615 23.5698 1.0580 1.7427 0.7547 237.9407 68.8306 84.3837
temp: 298.150 k
press: 1.00000 atm
elementType: 8 8 8 8 8 8 8 8 7 7 7 6 6 6 6 6 6 6 6 6 6 6 6 6 6 6 6 6 6 6 6 1 1 1 1 1 1 1 1 1 1 1 1 1 1 1 1 1 1 1 1 1
symmnumber: 1
zpe: 1036339.5 jmol-1
zpe.correction: 0.394721 hartree
zpe.thermalcorrener: 0.424065 hartree
zpe.thermalcorrenthalpy: 0.425009 hartree
zpe.thermalcorrgfe: 0.327545 hartree
zpe.sumelectzpe: -1538.454375 hartree
zpe.sumelectthermal: -1538.425031 hartree
zpe.sumelectthermalent: -1538.424087 hartree
zpe.sumelectthermalfe: -1538.521551 hartree
dipole: 0.3967 -3.2651 -3.3152
dipole: 4.6700
quadrupole: -181.5462 -186.2388 -188.1255
quadrupole: -23.2131 3.1605 -3.2089
quadrupole: 3.7573 -0.9353 -2.8220 -23.2131 3.1605 -3.2089
hfenergy: -1538.849096 hartree
pointgroup: C01 [X(C20H21N3O8)]
dipole: -0.0361969 -0.881052 -1.6118854 debye
polarizability: 327.2765301|3.5702772|268.5043449|33.5202119|35.5672138|197.5748346 unknown
InChI: InChI=1S/C20H21N3O8/c24-11-17(22-20(27)31-13-14-4-2-1-3-5-14)19(26)21-10-18(25)30-12-15-6-8-16(9-7-15)23(28)29/h1-9,17,21-22,24H,10-13H2
charge 0 multiplicity 1
52 atoms
O  -3.175183 0.551774 -0.710649
O  1.365023 -0.592752 0.18519
O  -1.848667 -3.148567 2.801033
O  -3.627037 -2.59202 0.693773
O  0.287472 -1.767864 -1.559651
O  -5.348627 0.385481 -1.527866
O  1.206892 5.530832 2.443706
O  2.262047 3.509958 2.365408
N  -0.251107 -2.115977 0.686028
N  -2.589373 -2.072595 -1.324515
N  1.233933 4.268813 2.171089
C  -1.230514 -3.181119 0.412306
C  -1.427986 -4.012995 1.69596
C  -2.591111 -2.588265 -0.052449
C  -3.799714 -1.487867 -1.892603
C  -2.268501 2.492821 0.443163
C  -3.516948 1.892637 -0.167101
C  0.457824 -1.51936 -0.322549
C  2.281609 0.064059 -0.822444
C  -4.214521 -0.109868 -1.359057
C  3.576038 -0.703074 -0.959657
C  -2.222355 3.890214 0.689814
C  -1.157288 1.687472 0.792805
C  0.015076 3.653804 1.592292
C  -1.084485 4.480533 1.270704
C  -0.005981 2.261775 1.364123
C  4.694234 -0.370257 -0.153668
C  3.685146 -1.765026 -1.894943
C  5.903899 -1.089259 -0.276203
C  4.894076 -2.484453 -2.01728
C  6.005633 -2.147915 -1.208826
H  -0.828894 -3.817072 -0.399482
H  -0.469058 -4.458142 2.008255
H  -2.163238 -4.81862 1.505509
H  -0.137763 -1.823763 1.661628
H  -1.677515 -1.985173 -1.804033
H  -3.678732 -1.396598 -2.986794
H  -4.662265 -2.15065 -1.705024
H  -3.920873 2.520006 -0.982718
H  -4.321112 1.764776 0.583314
H  2.436471 1.065942 -0.392999
H  1.732328 0.129125 -1.776711
H  -3.076614 4.52231 0.420784
H  -1.196472 0.614123 0.599768
H  -2.761283 -2.825827 2.552374
H  -1.026765 5.554374 1.465972
H  0.858365 1.648153 1.629699
H  4.615971 0.451099 0.569203
H  2.817839 -2.024633 -2.512917
H  6.763616 -0.823889 0.348763
H  4.972342 -3.301836 -2.742715
H  6.944642 -2.704248 -1.306806
