program: Gaussian 09
title: 000273176
version: EM64L-G09RevD.01
frameworkgroup: C1[X(C11H12Cl2O3)]
method: RPBEPBE
basis: SDD
operation: Freq
keyword: #p
keyword: freq=noraman
keyword: PBEPBE/SDD
title: #p freq=noraman PBEPBE/SDD
converged: YES YES NO NO
title: Mulliken charges:
elementType: Cl Cl O O O C C C C C C C C C C C H H H H H H H H H H H H
charge: -0.056358 -0.015533 -0.259132 -0.369698 -0.392726 0.189970 0.144361 -0.334437 -0.292502 -0.704579 0.412990 0.204944 -0.276318 -0.836906 -0.286661 -0.264706 0.236053 0.248287 0.240165 0.234680 0.247661 0.239757 0.243796 0.248094 0.277469 0.244908 0.282004 0.394416
chargesum: 0.00000
title: Mulliken charges with hydrogens summed into heavy atoms:
elementType: Cl Cl O O O C C C C C C C C C C C
charge: -0.056358 -0.015533 -0.259132 -0.369698 0.001690 0.189970 0.144361 0.149903 0.182342 0.026636 0.412990 0.204944 -0.276318 -0.066434 -0.286661 0.017297
polarizability: 1.71144576e+02 3.27151933e+00 1.75193063e+02 2.68269984e+00 -8.43823235e-01 9.40699594e+01
1716.lowfreq: -10.0918 -0.0012 0.0002 0.0006 7.5838 10.7855 32.6644 55.8195 90.5626
frequency: 32.1892 55.8088 90.5595 102.4373 117.4741 152.4825 166.6405 175.4081 189.6922 205.4213 233.3556 296.1094 312.6402 324.4191 331.7212 348.4767 358.3740 368.2775 391.5666 417.7972 499.1712 577.2584 589.6629 612.2174 635.0168 639.4815 695.9868 699.5851 735.3275 756.7393 786.4991 856.1792 866.3185 867.9650 904.2541 935.9040 960.4973 968.3627 995.3102 1031.7864 1040.5347 1081.8079 1088.1305 1112.5932 1157.8192 1176.3951 1181.2732 1196.8647 1214.0938 1262.0434 1312.3673 1325.8916 1328.9664 1360.2186 1390.0902 1393.0316 1405.6431 1452.8054 1458.2558 1462.7158 1470.9995 1474.3395 1484.7638 1496.4645 1567.8200 1597.6408 2991.1977 3006.3518 3010.8568 3018.5116 3033.7566 3059.6149 3097.6261 3113.6725 3122.6655 3125.1827 3154.4518 3185.8211
redmass: 3.8692 4.2285 3.5160 1.9567 2.8224 4.3832 2.7180 8.9207 3.7229 1.1435 2.7384 4.7862 4.2173 5.9269 5.1683 6.2868 6.4417 8.5217 4.4797 5.0721 4.1847 4.7863 4.5673 6.2592 4.9440 3.5560 7.6286 6.4179 4.6192 7.1101 4.1366 1.8749 3.1924 1.3914 1.6855 1.6211 3.4659 3.2317 4.3387 1.6859 1.4884 2.9333 1.8373 1.6802 3.3923 1.2064 1.7270 1.7884 1.9134 5.4909 1.6723 1.2481 2.3465 5.5047 2.5702 1.2371 1.2038 1.1043 1.0635 1.1198 1.4952 1.2838 1.1437 1.0806 6.7804 4.8155 1.0420 1.0659 1.0354 1.0614 1.0623 1.0961 1.1088 1.0996 1.1012 1.1032 1.0949 1.0935
irintensity: 1.4212 3.4156 1.9450 2.9294 2.9956 0.5166 1.3339 0.1677 0.1019 0.3045 2.2572 0.9260 4.9572 0.9169 3.3838 3.8556 5.3603 8.4853 8.0574 9.3588 12.9488 16.3276 3.3072 4.3061 12.4448 7.8084 69.8329 23.8264 8.6487 10.6010 25.2905 4.4975 3.4028 20.4797 22.3019 137.6615 18.6559 7.8361 50.0968 39.2002 1.2375 2.9263 13.9819 6.5027 196.9859 4.4008 42.7248 42.8318 40.1993 78.4918 13.0947 0.8603 18.8553 4.4153 286.8473 30.8133 5.9468 10.7252 10.8258 7.5767 10.0800 8.7843 3.1343 14.6655 1.6350 12.8462 14.2585 29.6096 6.6962 569.6210 144.9359 11.1302 11.5178 6.5882 21.4979 29.6677 3.0123 0.7497
temp: 298.150 k
press: 1.00000 atm
elementType: 17 17 8 8 8 6 6 6 6 6 6 6 6 6 6 6 1 1 1 1 1 1 1 1 1 1 1 1
symmnumber: 1
zpe: 548473.8 jmol-1
zpe.correction: 0.208903 hartree
zpe.thermalcorrener: 0.224635 hartree
zpe.thermalcorrenthalpy: 0.225579 hartree
zpe.thermalcorrgfe: 0.165363 hartree
zpe.sumelectzpe: -1570.943374 hartree
zpe.sumelectthermal: -1570.927641 hartree
zpe.sumelectthermalent: -1570.926697 hartree
zpe.sumelectthermalfe: -1570.986914 hartree
dipole: 4.2893 -1.9189 -1.4696
dipole: 4.9234
quadrupole: -100.6804 -119.0127 -101.6568
quadrupole: 1.1463 -6.0097 -3.0270
quadrupole: 6.4362 -11.8961 5.4598 1.1463 -6.0097 -3.0270
hfenergy: -1571.1522764 hartree
pointgroup: C01 [X(C11H12Cl2O3)]
dipole: 1.8335383 -0.5474932 -0.3007688 debye
polarizability: 168.628699|4.0309637|174.716114|11.0786795|-10.2210941|97.062786 unknown
InChI: InChI=1S/C11H12Cl2O3/c1-6-7(12)5-8(13)10(14)9(6)11(2)15-3-4-16-11/h5,14H,3-4H2,1-2H3
charge 0 multiplicity 1
28 atoms
Cl -2.835739 -2.876673 -0.282008
Cl -2.809428 2.62103 -0.794532
O  2.492597 -0.985586 0.032305
O  2.266514 1.313529 0.292421
O  0.018731 2.411309 0.018523
C  1.633185 -0.010543 0.702426
C  0.156749 -0.068055 0.224791
C  2.790859 -0.398124 -1.291053
C  3.060847 1.085062 -0.949148
C  1.795501 -0.143989 2.212158
C  -0.528398 -1.327959 0.178041
C  -0.550872 1.152168 -0.057717
C  -1.894442 -1.30628 -0.195124
C  0.105331 -2.664511 0.531132
C  -1.920573 1.087889 -0.421998
C  -2.602966 -0.131611 -0.499046
H  1.92268 -0.514608 -1.966869
H  3.665769 -0.931192 -1.689263
H  4.11739 1.277253 -0.702379
H  2.711881 1.78198 -1.730131
H  2.866243 -0.124116 2.471051
H  1.282988 0.69254 2.715799
H  1.348777 -1.086309 2.568311
H  -0.05469 -3.389376 -0.287496
H  1.184479 -2.593123 0.708192
H  -0.388917 -3.093599 1.42297
H  -3.65707 -0.16411 -0.783013
H  1.017575 2.285005 0.184058
