program: Gaussian 09
title: 000273157
version: EM64L-G09RevD.01
frameworkgroup: C1[X(C11H13NO)]
method: RPBEPBE
basis: SDD
operation: Freq
keyword: #p
keyword: freq=noraman
keyword: PBEPBE/SDD
title: #p freq=noraman PBEPBE/SDD
converged: NO YES NO NO
title: Mulliken charges:
elementType: O N C C C C C C C C C C C H H H H H H H H H H H H H
charge: -0.231395 -0.155796 -0.454958 -0.363848 -0.511327 0.297541 0.160887 0.089657 -0.675646 -0.357932 -0.361404 -0.234122 -0.261848 0.221700 0.255199 0.210863 0.223262 0.232829 0.243019 0.234658 0.243032 0.224714 0.238650 0.275970 0.224332 0.231961
chargesum: 0.00000
title: Mulliken charges with hydrogens summed into heavy atoms:
elementType: O N C C C C C C C C C C C
charge: -0.231395 -0.155796 0.021941 0.070277 -0.035479 0.297541 0.160887 0.089657 0.026759 -0.119282 -0.085434 -0.009790 -0.029887
polarizability: 1.63927790e+02 9.48385164e-01 1.47747146e+02 -3.77825055e-01 3.25845418e+00 7.24012729e+01
1716.lowfreq: -0.0011 -0.0010 -0.0008 6.4707 10.2998 19.5590 70.5550 113.8058 134.5492
frequency: 70.5363 113.7876 134.5334 159.7397 211.3351 215.5785 275.0914 322.9355 336.7424 349.1039 385.4709 433.6628 501.8456 525.8431 537.9772 559.9994 578.3968 655.9455 726.7189 746.4364 758.9385 772.1102 783.6260 855.3012 879.4647 921.4791 961.6229 969.1950 987.7967 1034.3611 1046.0730 1054.9708 1072.1792 1107.9310 1111.1379 1118.8309 1165.1964 1174.2242 1185.7091 1222.1693 1249.7776 1262.6604 1296.5529 1306.7678 1341.0291 1354.9382 1367.6863 1387.3484 1434.7637 1446.1372 1452.6148 1462.4585 1468.3208 1479.3651 1488.8378 1501.8951 1561.6086 1567.2652 1614.7342 2928.1275 2970.2556 2987.0603 3000.7653 3038.1412 3041.0177 3055.9324 3085.8223 3091.9524 3127.9039 3144.0699 3160.7931 3170.8218
redmass: 4.0725 3.2437 3.4429 3.9168 2.1784 1.1998 3.6813 3.5574 4.7462 3.2183 3.3982 3.6581 2.5611 3.4623 3.2099 3.4922 4.5586 4.9368 3.0872 2.4912 2.1646 2.1657 1.9146 1.4893 3.0675 2.2780 1.3867 2.5218 1.3367 2.6401 2.0121 2.1121 2.4476 1.3636 1.8193 1.8704 1.3744 1.1054 1.6226 1.7131 1.6483 1.7637 1.6332 1.5325 1.6079 1.8003 1.4087 5.0093 1.7318 1.5441 1.1034 1.2222 1.1539 1.0515 1.3523 1.4201 7.5102 7.4569 6.4741 1.0484 1.0634 1.0599 1.0627 1.0856 1.0973 1.1036 1.1016 1.0999 1.0861 1.0892 1.0939 1.0988
irintensity: 2.6117 2.9800 2.4040 2.4670 1.3967 0.2412 5.3957 5.8554 3.1342 2.9985 0.2516 1.3048 3.1695 6.6128 7.8545 6.3385 6.1621 1.3306 11.5464 5.8561 53.9720 30.2685 5.6059 0.8862 3.4560 9.8750 3.6049 36.5523 2.0322 7.2525 7.5546 8.1081 2.8385 10.6121 19.7125 12.5359 25.1129 2.5717 18.5671 38.3272 29.8093 4.3556 55.5834 9.6925 30.5285 41.9952 9.5361 8.6604 49.6366 9.0156 9.9258 74.7436 19.8145 5.5220 9.4262 109.5313 18.1796 218.9640 123.6272 100.1734 33.4053 52.5353 11.2579 35.9563 20.8963 39.9389 24.2365 22.7307 7.1460 3.3083 21.9161 23.1251
temp: 298.150 k
press: 1.00000 atm
elementType: 8 7 6 6 6 6 6 6 6 6 6 6 6 1 1 1 1 1 1 1 1 1 1 1 1 1
symmnumber: 1
zpe: 567457.1 jmol-1
zpe.correction: 0.216133 hartree
zpe.thermalcorrener: 0.227298 hartree
zpe.thermalcorrenthalpy: 0.228242 hartree
zpe.thermalcorrgfe: 0.179576 hartree
zpe.sumelectzpe: -555.983060 hartree
zpe.sumelectthermal: -555.971895 hartree
zpe.sumelectthermalent: -555.970951 hartree
zpe.sumelectthermalfe: -556.019617 hartree
dipole: 1.0213 5.1460 0.4120
dipole: 5.2625
quadrupole: -67.6432 -81.1028 -79.0028
quadrupole: 4.1910 -0.4069 -1.5490
quadrupole: 8.2731 -5.1866 -3.0865 4.1910 -0.4069 -1.5490
hfenergy: -556.1991927 hartree
pointgroup: C01 [X(C11H13N1O1)]
dipole: 0.3851531 2.02819 0.1575789 debye
dipolederiv: -0.5319319 0.0993065 -0.0563981 0.2916482 -1.1693775 -0.0912029 -0.0620623 -0.1564433 -0.3606738 -1.1588727 -0.5452442 0.0366824 -0.2146153 -0.7585694 0.0621429 -0.0851082 -0.184178 -0.3135899 0.5502448 -0.0033122 -0.1052926 -0.2760774 0.1177451 0.0756501 -0.0944171 0.0337461 0.2707727 0.1209311 0.0747031 -0.0146502 0.119413 0.0979003 0.0446752 -0.066452 0.0845501 0.0679332 -0.2460055 -0.1506437 -0.1046678 -0.2033724 -0.0217092 -0.0281159 -0.1208244 -0.0922338 0.0137401 1.0658455 0.7174 -0.0178246 0.4292772 0.369288 -0.1199268 -0.0662712 -0.0318962 0.0816712 -0.6848859 0.5116421 -0.0536874 -0.1170848 -0.4539199 0.0066657 -0.15524 0.0347808 -0.1193835 1.0651452 -0.480996 0.2695788 -0.4399388 1.2571272 0.1606011 0.3373865 0.1795802 0.2232207 0.0756768 -0.0594559 0.0573977 0.0820327 0.7007505 -0.0353231 0.0992425 0.0268588 0.2154717 -0.4891818 -0.3749676 0.0054429 0.0791566 0.053759 0.0199923 0.0872791 0.0946085 -0.2309741 0.3315687 -0.3187222 -0.0098756 0.1494775 0.0402955 0.0188059 0.064106 -0.0577419 -0.090172 0.1766697 0.1581018 -0.0061831 -0.0234804 0.3914259 0.0344148 -0.0225483 0.0363943 -0.1190919 -0.1418914 0.2536031 0.0189994 0.1553062 -0.3931797 0.0098456 0.0022914 0.001717 -0.205171 -0.0497798 -0.0698617 0.0618413 -0.0928153 -0.0764551 0.1165151 0.0628421 0.0912406 0.0485223 -0.013119 -0.0260483 -0.0890346 0.0480826 -0.0153257 -0.1231877 -0.0147748 -0.0226673 -0.0493521 -0.057026 -0.0506504 -0.0829397 -0.1512533 -0.0145592 -0.0589605 -0.1058643 -0.0405256 -0.014474 -0.0492444 0.0413486 0.0805927 0.1166113 0.0140128 -0.06515 0.1282164 -0.0507892 -0.0302954 0.0125515 0.0117118 0.0755407 0.0153535 0.0560655 -0.1086047 0.0567377 -0.0551694 -0.0277785 -0.0094378 0.0657937 -0.052601 0.0952356 -0.0409643 0.0856266 -0.0493485 0.0446808 0.050711 -0.1212597 -0.1247955 -0.0419058 -0.0414379 0.0401317 -0.0006 -0.019884 0.0124552 0.1090947 0.0552556 0.108435 0.1174253 0.0108301 0.0222324 -0.014092 0.0699418 -0.0696956 -0.0676886 0.0647248 0.1460747 -0.0811552 -0.0174323 -0.1613441 0.0602545 -0.062911 0.1577862 -0.0751037 0.0881003 -0.0212617 -0.0027913 0.0083599 -0.1137917 -0.0177958 0.0228483 0.0104166 0.1597533 0.1247146 0.0229998 -0.0013539 -0.0409104 -0.0139393 -0.0083172 -0.006854 -0.0101147 0.1447497 -0.0851408 0.0948339 0.0110108 0.1096042 0.0398971 -0.0108899 0.0071195 -0.0332643 0.1482954 -0.093652 -0.0799949 -0.0141513 -0.0919703 0.032504 -0.0130234 -0.0054514 -0.0040957 0.1698125 unknown
polarizability: 163.9053603|1.0180006|147.7924153|0.9558958|2.8896725|72.3784338 unknown
InChI: InChI=1S/C11H13NO/c1-12-8-4-7-11(13)9-5-2-3-6-10(9)12/h2-3,5-6H,4,7-8H2,1H3
charge 0 multiplicity 1
26 atoms
O  0.778608 -2.805733 -0.181447
N  0.803595 1.44374 -0.016672
C  1.932463 0.869816 -0.794634
C  2.845199 -0.05736 0.034882
C  1.982591 -0.997094 0.91818
C  -0.404762 0.728656 0.048681
C  -0.424573 -0.713659 -0.019799
C  0.783172 -1.583823 0.168473
C  0.820154 2.893144 0.229737
C  -1.655539 1.417531 0.131864
C  -1.674053 -1.385497 -0.131874
C  -2.873263 0.717092 0.07334
C  -2.894272 -0.691613 -0.087839
H  2.51576 1.702832 -1.227815
H  1.509284 0.2915 -1.641003
H  3.523278 0.529639 0.683359
H  3.474705 -0.648743 -0.657718
H  1.606068 -0.408668 1.776606
H  2.589636 -1.836691 1.296916
H  1.864089 3.224699 0.355954
H  0.278397 3.134396 1.161387
H  0.368038 3.481702 -0.598758
H  -1.676037 2.508645 0.200391
H  -1.642648 -2.477839 -0.207979
H  -3.814395 1.2764 0.132017
H  -3.844498 -1.230969 -0.151548
