program: Gaussian 09
title: 000273172
version: EM64L-G09RevD.01
frameworkgroup: C1[X(C10H14Cl2O3)]
method: RPBEPBE
basis: SDD
operation: Freq
keyword: #p
keyword: freq=noraman
keyword: PBEPBE/SDD
title: #p freq=noraman PBEPBE/SDD
converged: YES YES NO NO
title: Mulliken charges:
elementType: Cl Cl O O O C C C C C C C C C C H H H H H H H H H H H H H H
charge: -0.061987 -0.056771 -0.268800 -0.401060 -0.236473 -0.201527 0.027379 -0.414677 -0.444016 -0.394845 -0.362208 0.166691 -0.306787 -0.059192 -0.560706 0.305803 0.220119 0.248178 0.249633 0.290128 0.296032 0.231165 0.264628 0.203033 0.202132 0.381226 0.241162 0.222847 0.218893
chargesum: 0.00000
title: Mulliken charges with hydrogens summed into heavy atoms:
elementType: Cl Cl O O O C C C C C C C C C C
charge: -0.061987 -0.056771 -0.268800 -0.019833 -0.236473 0.104276 0.247498 0.083135 -0.153888 -0.098814 0.133585 0.166691 0.098378 0.181970 -0.118966
polarizability: 1.72199602e+02 -7.00897049e+00 1.16363101e+02 -1.26218996e-01 -4.47377950e+00 1.14073079e+02
1716.lowfreq: -14.9362 -7.5616 -0.0026 0.0004 0.0015 3.6371 29.3771 31.0303 42.3499
frequency: 29.2765 30.8716 42.3292 50.1840 87.7094 96.7627 107.3566 125.6656 140.5520 187.7392 220.3429 238.3382 257.1011 279.2372 289.1989 373.3342 388.7715 428.9071 452.7778 500.0125 524.1216 551.6839 604.8340 609.2676 636.0879 654.7770 713.8409 755.1600 843.6931 871.4420 896.6553 904.7287 940.9216 954.1463 958.6950 976.3520 989.6877 1010.5992 1031.7094 1046.2747 1056.2048 1075.4987 1093.1328 1137.4743 1149.1313 1181.1992 1199.9897 1208.4133 1212.9444 1225.6170 1247.0044 1271.2794 1280.4815 1285.3523 1299.6687 1308.8890 1327.7908 1343.9423 1357.6172 1360.6954 1375.9580 1434.3676 1448.6599 1468.8412 1474.8367 1657.8753 1666.6334 2909.5820 2928.4512 2989.9065 2993.3742 3006.8637 3057.9367 3073.1845 3076.2974 3082.9454 3092.4764 3096.6198 3123.4048 3202.1870 3506.5844
redmass: 4.8546 3.8293 4.6631 4.6837 5.5634 5.0693 4.6869 4.8916 4.0699 7.5791 6.3360 5.3220 4.1880 5.2176 3.6972 3.2106 4.7663 1.9704 2.7414 3.9425 5.7296 3.0151 3.1824 1.4581 3.1179 2.4075 4.5132 4.6356 2.8262 1.5281 2.7877 2.2833 2.2274 1.9220 1.9778 1.7592 2.5733 1.2369 2.3259 2.7729 3.0366 2.1001 1.9076 2.3520 1.7217 1.1807 1.8545 1.2662 1.2723 1.2625 1.4141 1.2911 1.2345 1.2724 1.2752 1.3326 1.4876 1.3653 1.4225 1.5441 1.6701 1.1969 1.0868 1.1004 1.0900 8.4512 4.7974 1.0807 1.0563 1.1038 1.0658 1.0616 1.0861 1.0918 1.0897 1.0955 1.0606 1.0953 1.0945 1.1143 1.0638
irintensity: 0.6006 1.9773 1.7827 0.6516 1.6376 1.3105 1.6983 2.4099 1.2628 1.3081 2.8954 3.7986 3.0478 1.6543 3.6037 3.9465 5.9767 0.5668 10.0038 11.7211 30.4828 24.0128 38.6978 106.1144 22.8116 11.5816 31.6639 30.4509 1.8719 24.0497 6.9186 19.9608 31.0740 41.2830 30.6538 6.3812 20.5110 31.4222 18.9797 102.7566 213.3699 66.9236 69.2764 7.2129 0.4654 0.1607 2.8716 14.8692 2.7686 9.9749 3.2569 0.6860 0.9201 10.9302 20.3568 12.5564 16.2332 30.5638 13.6447 20.2855 32.6843 17.4076 14.7478 5.3985 14.0863 188.6874 3.5249 18.9755 49.9338 35.3255 10.0137 8.3338 1.5331 8.2227 5.7817 17.2054 9.3883 12.0443 5.9471 24.0473 26.6950
temp: 298.150 k
press: 1.00000 atm
elementType: 17 17 8 8 8 6 6 6 6 6 6 6 6 6 6 1 1 1 1 1 1 1 1 1 1 1 1 1 1
symmnumber: 1
zpe: 592692.6 jmol-1
zpe.correction: 0.225745 hartree
zpe.thermalcorrener: 0.242057 hartree
zpe.thermalcorrenthalpy: 0.243001 hartree
zpe.thermalcorrgfe: 0.179116 hartree
zpe.sumelectzpe: -1534.067923 hartree
zpe.sumelectthermal: -1534.051611 hartree
zpe.sumelectthermalent: -1534.050666 hartree
zpe.sumelectthermalfe: -1534.114552 hartree
dipole: -1.6206 -0.3502 -1.2379
dipole: 2.0692
quadrupole: -108.2322 -101.0680 -103.0453
quadrupole: 0.6379 2.5216 9.4746
quadrupole: -4.1171 3.0472 1.0699 0.6379 2.5216 9.4746
hfenergy: -1534.2936679 hartree
pointgroup: C01 [X(C10H14Cl2O3)]
dipole: 0.6742611 -0.1138628 0.4417482 debye
polarizability: 169.2687043|14.4529566|118.0252206|-1.6575189|4.1947924|115.3418571 unknown
InChI: InChI=1S/C10H14Cl2O3/c1-2-3-15-9-7(10(13)14)4-6(11)5-8(9)12/h2,6-9,13H,1,3-5H2
charge 0 multiplicity 1
29 atoms
Cl -0.297376 -2.314621 -1.670668
Cl -4.513708 -0.935857 0.61509
O  1.467088 -0.118112 -0.279061
O  -0.206142 2.962239 -1.134524
O  0.08058 2.509342 1.124276
C  -0.760629 0.735839 -0.374753
C  0.142801 -0.318494 0.299036
C  -2.236642 0.61541 0.120134
C  -0.412301 -1.751877 0.151534
C  -2.750049 -0.813355 -0.091059
C  -1.876071 -1.857974 0.61561
C  -0.238912 2.121568 -0.021399
C  2.560418 -0.812629 0.435561
C  3.850772 -0.435855 -0.243556
C  4.949176 0.021106 0.404998
H  -0.707354 0.600162 -1.468277
H  0.173362 -0.108303 1.39609
H  -2.289542 0.86992 1.195582
H  -2.873579 1.332695 -0.425735
H  0.218617 -2.487006 0.675406
H  -2.873879 -1.053989 -1.158267
H  -1.910972 -1.678339 1.709365
H  -2.257029 -2.87644 0.433932
H  2.564084 -0.515769 1.505838
H  2.404661 -1.912169 0.367671
H  0.124203 3.86127 -0.860143
H  3.859796 -0.573712 -1.333112
H  5.875669 0.250481 -0.132349
H  4.95526 0.181572 1.490378
