program: Gaussian 09
title: 000273146
version: EM64L-G09RevD.01
frameworkgroup: C1[X(C12H11NO3)]
method: RPBEPBE
basis: SDD
operation: Freq
keyword: #p
keyword: freq=noraman
keyword: PBEPBE/SDD
title: #p freq=noraman PBEPBE/SDD
converged: YES YES NO NO
title: Mulliken charges:
elementType: O O O N C C C C C C C C C C C C H H H H H H H H H H H
charge: -0.299605 -0.269955 -0.297934 -0.278186 0.249336 0.074367 0.206213 -0.312656 -0.215017 -0.150738 -0.351928 0.196257 -0.199779 -0.223977 -0.216904 -0.675135 0.321743 0.281173 0.300560 0.246781 0.248123 0.240196 0.227712 0.228129 0.212629 0.229342 0.229254
chargesum: 0.00000
title: Mulliken charges with hydrogens summed into heavy atoms:
elementType: O O O N C C C C C C C C C C C C
charge: -0.299605 -0.269955 -0.297934 -0.278186 0.249336 0.074367 0.206213 0.009087 0.066156 0.149822 -0.105148 0.196257 0.048344 0.016219 0.238936 -0.003910
polarizability: 2.35943539e+02 -5.85073477e+00 1.79665550e+02 2.40604581e-01 -5.34151679e-02 6.62194194e+01
1716.lowfreq: -25.4728 -3.2981 0.0009 0.0010 0.0011 5.7137 11.7915 62.3748 74.7119
frequency: -19.0256 62.2410 74.7091 99.5079 121.5054 128.8583 188.8722 226.1538 248.6411 287.4643 295.7484 336.9573 361.9327 408.3187 416.1712 451.6639 454.5774 552.3277 572.0115 578.4857 629.4265 674.6180 700.1841 700.6794 756.4855 776.5314 782.1122 792.9902 796.6137 834.7838 838.3788 901.6959 965.5596 990.3720 993.6432 1022.5145 1025.4491 1038.0347 1047.2983 1086.6762 1108.7727 1114.5610 1136.2683 1157.1461 1179.5459 1227.6364 1243.7697 1246.0885 1277.0273 1323.9576 1356.1515 1383.5095 1398.1534 1409.6596 1436.3915 1463.6239 1473.6899 1486.8888 1505.5263 1530.2249 1575.3130 1592.2841 1631.2240 1668.9328 2994.6048 3009.0466 3066.6782 3091.3989 3105.8594 3156.0809 3172.9181 3173.3529 3181.5693 3192.3890 3193.1916
redmass: 2.5674 3.5991 7.3246 3.9091 4.5249 3.0695 4.3316 4.7941 1.2556 5.9437 5.4037 7.1345 7.3105 4.8162 3.3842 3.7498 7.5072 7.6175 3.5910 5.1308 7.8908 3.4918 6.1986 6.2788 5.9830 5.7207 6.9558 1.3200 1.1152 3.8612 1.5402 1.3726 4.9631 1.3199 1.3144 1.2940 3.1336 3.2451 2.9598 2.5522 2.5769 2.3581 1.4673 1.5796 1.3912 1.7743 1.7596 1.1332 1.8768 4.0573 1.4037 2.0904 1.2790 2.1960 2.6505 1.0408 1.0581 1.0719 5.1772 5.9074 7.9203 8.9023 5.9152 9.1253 1.0357 1.0580 1.1064 1.0985 1.1026 1.0889 1.0884 1.0893 1.0961 1.1003 1.0975
irintensity: 0.3519 1.1864 3.1642 0.8300 6.1779 4.5526 0.0076 2.8818 0.7993 12.3310 0.2782 2.7984 4.4049 14.3318 6.7790 0.6690 2.2107 16.3513 8.4457 1.4573 2.7065 0.4299 5.0103 3.5538 11.4698 4.4455 5.4947 102.4403 0.0176 0.0789 49.2723 0.9771 149.2142 4.1147 0.0707 2.6293 106.7057 62.4646 12.8098 147.9044 109.4778 73.6572 5.3754 60.9715 24.7407 223.5734 196.9769 0.0482 38.3028 3.8256 4.3528 40.9158 17.8415 8.5144 2.2877 12.3106 9.2445 16.3501 269.6816 6.5511 59.6519 354.4821 69.3230 388.1117 24.0325 23.2196 8.3397 32.3169 46.2741 15.0096 0.7491 1.5724 18.0518 16.4478 2.5429
temp: 298.150 k
press: 1.00000 atm
elementType: 8 8 8 7 6 6 6 6 6 6 6 6 6 6 6 6 1 1 1 1 1 1 1 1 1 1 1
symmnumber: 1
zpe: 541212.3 jmol-1
zpe.correction: 0.206137 hartree
zpe.thermalcorrener: 0.219128 hartree
zpe.thermalcorrenthalpy: 0.220072 hartree
zpe.thermalcorrgfe: 0.166402 hartree
zpe.sumelectzpe: -743.176802 hartree
zpe.sumelectthermal: -743.163811 hartree
zpe.sumelectthermalent: -743.162867 hartree
zpe.sumelectthermalfe: -743.216537 hartree
dipole: -1.3857 -2.3293 0.0034
dipole: 2.7103
quadrupole: -79.4418 -95.4541 -94.8894
quadrupole: -18.4104 0.0017 -0.0627
quadrupole: 10.4867 -5.5257 -4.9610 -18.4104 0.0017 -0.0627
hfenergy: -743.3829389 hartree
pointgroup: C01 [X(C12H11N1O3)]
dipole: 0.6597726 0.7998504 -0.248953 debye
polarizability: 232.9659003|-9.1438046|168.4176948|12.8403097|-37.3943736|80.4449127 unknown
InChI: InChI=1S/C12H11NO3/c1-2-16-12(15)9-6-7-11(14)13-8-4-3-5-10(9)13/h3-8H,2H2,1H3
charge 0 multiplicity 1
27 atoms
O  2.840616 -0.340155 0.514664
O  -3.297834 -1.763935 0.676223
O  2.142444 1.729982 -0.278454
N  -1.944499 0.096459 0.08084
C  -0.683288 0.723426 -0.07437
C  0.49381 -0.019933 0.259459
C  -2.119812 -1.309165 0.577383
C  -0.688621 2.076153 -0.562516
C  0.34899 -1.358794 0.732027
C  -3.129028 0.76165 -0.225589
C  -0.888909 -1.975086 0.883952
C  1.842836 0.569659 0.12506
C  -1.876624 2.733377 -0.867133
C  -3.128472 2.061757 -0.695449
C  4.24319 0.158439 0.416141
C  5.14472 -0.973428 0.898907
H  0.285731 2.554194 -0.679223
H  1.260471 -1.907762 0.980236
H  -4.023537 0.156724 -0.057003
H  -0.974841 -3.001648 1.247471
H  -1.850903 3.762965 -1.237248
H  -4.078094 2.550394 -0.925648
H  4.440887 0.439716 -0.634158
H  4.335456 1.068338 1.036395
H  6.202458 -0.657357 0.844214
H  4.916658 -1.241298 1.944837
H  5.019091 -1.873172 0.27248
