program: Gaussian 09
title: 000273153
version: EM64L-G09RevD.01
frameworkgroup: C1[X(C11H10Cl2O2)]
method: RPBEPBE
basis: SDD
operation: Freq
keyword: #p
keyword: freq=noraman
keyword: PBEPBE/SDD
title: #p freq=noraman PBEPBE/SDD
converged: YES YES NO NO
title: Mulliken charges:
elementType: Cl Cl O O C C C C C C C C C C C H H H H H H H H H H
charge: -0.007822 -0.047440 -0.241703 -0.206806 0.002260 -0.514243 0.080764 0.089804 0.359344 0.465366 -0.705457 -0.354128 -0.365289 -0.235032 -0.774285 0.230477 0.251342 0.248548 0.246694 0.216241 0.228123 0.285777 0.256229 0.255764 0.235472
chargesum: 0.00000
title: Mulliken charges with hydrogens summed into heavy atoms:
elementType: Cl Cl O O C C C C C C C C C C C
charge: -0.007822 -0.047440 -0.241703 -0.206806 0.232737 -0.014352 0.080764 0.089804 0.359344 0.465366 -0.014399 -0.354128 -0.365289 0.050745 -0.026820
polarizability: 1.95692401e+02 3.46689490e+00 1.74234806e+02 -8.63417642e-01 -7.42245365e-01 7.21395553e+01
1716.lowfreq: -8.4749 -2.8693 0.0007 0.0012 0.0021 6.5681 39.8046 76.3244 96.4581
frequency: 39.7684 76.3042 96.4462 116.2075 152.2450 159.8124 173.9801 192.3650 207.7528 264.6856 273.2529 315.6702 334.7817 340.2864 356.1176 375.9910 425.4434 444.2341 474.1700 494.0517 547.0657 595.2583 613.4110 642.9952 662.2482 724.1560 760.2659 817.8321 841.7514 878.3727 906.0169 926.2262 981.8813 1005.9089 1034.2012 1048.7341 1079.6270 1109.7290 1148.4228 1184.4818 1196.4716 1231.7082 1258.2884 1274.8666 1317.5188 1346.1572 1360.4519 1364.2542 1396.9380 1402.9814 1425.9030 1426.1907 1457.6443 1460.9266 1461.9791 1476.8414 1551.0759 1571.7425 1595.8600 2971.9858 2991.3519 2997.7247 3007.4224 3082.7395 3084.4959 3098.4967 3105.4902 3124.1880 3181.6200
redmass: 5.7535 4.1936 3.6527 3.7876 5.8849 6.7851 1.1271 11.7816 1.0680 3.9923 4.5375 5.4464 14.5146 3.8130 8.7719 5.9394 3.1697 3.7237 4.6496 4.7303 3.7553 4.6289 4.9550 5.3724 5.2614 6.6759 5.4997 6.6262 4.6112 1.4207 1.6736 2.0871 2.3977 2.4670 1.5392 2.2412 3.6346 2.1710 1.8622 1.9451 1.5717 2.8125 5.0695 1.3387 1.5995 4.2907 3.2575 1.9276 1.2582 1.4267 1.4768 1.5648 1.1215 1.1406 1.0705 1.0496 8.0138 8.9742 9.5729 1.0825 1.0671 1.0362 1.0376 1.0953 1.0963 1.0994 1.1006 1.1002 1.0934
irintensity: 3.2181 1.0186 3.2965 0.5660 0.4762 1.6714 2.2378 0.0324 0.1552 0.1018 1.4015 2.5038 0.8818 5.7675 0.8116 1.6016 4.7778 2.8464 1.7780 4.2832 15.8380 13.3753 0.1274 4.6012 7.8466 68.3466 15.4659 16.9881 30.5192 13.8597 5.0016 13.1930 0.4621 7.2894 5.2238 61.5853 20.2050 11.1142 23.3816 55.8111 18.3427 40.2327 250.5038 2.7137 29.2457 36.2131 36.9510 23.3501 45.7419 30.0665 36.9586 102.8113 48.9394 57.5882 21.4927 9.5128 32.4149 74.8472 130.8607 19.5233 13.8781 15.9840 4.3912 6.4650 5.4936 24.4696 19.5996 13.9456 1.0435
temp: 298.150 k
press: 1.00000 atm
elementType: 17 17 8 8 6 6 6 6 6 6 6 6 6 6 6 1 1 1 1 1 1 1 1 1 1
symmnumber: 1
zpe: 478778.2 jmol-1
zpe.correction: 0.182357 hartree
zpe.thermalcorrener: 0.196702 hartree
zpe.thermalcorrenthalpy: 0.197646 hartree
zpe.thermalcorrgfe: 0.140674 hartree
zpe.sumelectzpe: -1494.646584 hartree
zpe.sumelectthermal: -1494.632239 hartree
zpe.sumelectthermalent: -1494.631295 hartree
zpe.sumelectthermalfe: -1494.688266 hartree
dipole: 2.6634 -0.0101 0.2896
dipole: 2.6792
quadrupole: -91.9016 -112.4402 -100.2463
quadrupole: -3.7779 1.2162 0.2427
quadrupole: 9.6278 -10.9108 1.2831 -3.7779 1.2162 0.2427
hfenergy: -1494.8289408 hartree
pointgroup: C01 [X(C11H10Cl2O2)]
dipole: 1.0389585 0.0684118 0.1640988 debye
dipolederiv: -0.1267396 -0.187904 0.0085758 -0.1890351 -0.7233857 0.0369887 -0.0009438 0.0262316 -0.0350665 -0.8536284 -0.04604 -0.0238254 -0.0553038 -0.1164182 0.0023088 -0.0188674 0.0044386 -0.0598892 -1.7546758 -0.0888885 -0.1830669 0.0703929 -0.3007652 -0.0179064 -0.0863872 0.0241173 -0.2639282 -0.5366824 -0.0173206 0.0105866 0.1350458 -1.1000048 0.0446228 0.0267999 0.0471579 -0.2898752 0.8984812 -0.0318316 0.1308809 -0.3984901 0.3143116 -0.0580212 0.2315472 -0.0237011 0.4114396 -0.4397367 -0.1210623 0.0298438 -0.0611147 -0.0919375 -0.0121734 0.0241883 -0.0375366 0.0358778 -0.6004822 0.5328338 -0.0144702 0.1973978 -0.5520931 0.0004095 0.0439199 0.0311515 -0.0844294 1.1186466 -0.3486089 -0.0875176 -0.3625179 1.3154022 -0.0870216 -0.1240175 -0.0659249 0.1358618 1.3543126 0.0968129 0.1233563 -0.0025379 -0.0498306 0.0752311 0.0433457 0.0081182 0.1318323 -0.0878127 -0.2415985 0.0012282 0.2322413 0.407255 -0.0226849 -0.029478 -0.022205 0.055377 -0.1499626 -0.0462015 -0.0027746 -0.0705098 0.0185378 -0.0093951 -0.026851 -0.0066643 0.0644226 -0.3169968 0.2087915 -0.0378004 0.4436111 1.1138594 -0.0640957 -0.0796701 -0.0761346 -0.1299153 1.2072605 0.1456993 0.0307075 -0.0308314 -0.3301402 -0.0030452 0.0408351 0.011468 -0.1172706 -0.0938087 0.0631477 0.0013541 0.0337404 -0.0653212 0.0115331 0.0055545 0.0043658 -0.0078244 0.0607454 0.0215324 -0.0004693 -0.1857487 -0.2524041 0.0108157 0.0112382 0.0071197 0.0144338 -0.027969 -0.0219191 0.0791236 0.105032 0.0197908 0.0308209 -0.0285121 0.0200248 -0.1485907 0.0108985 0.0590998 -0.0348924 0.1106258 0.0071049 0.034889 -0.0603112 0.0426952 0.0880724 0.0728099 -0.0115458 0.0155361 -0.0559206 0.0831342 0.0414972 0.0099535 -0.0121413 -0.0645739 0.0869341 -0.0033693 0.0049024 -0.0844181 -0.0656235 -0.0912091 0.0059264 -0.0820689 0.0574514 -0.0271719 0.059607 -0.0467473 0.122545 0.0038369 0.0739062 -0.052637 0.0621199 0.0712842 0.0886488 -0.0058124 -0.0005524 -0.0295002 0.0887701 -0.0021697 0.0668321 0.0219072 -0.1184443 0.0752994 0.0434429 -0.0071058 0.0333191 0.0603755 0.0080331 -0.0023917 0.0144569 0.1587043 0.0718246 0.0159069 0.0713381 0.0064777 0.0457777 -0.0550122 0.0503039 -0.0636351 0.0059544 0.0726769 0.0030805 -0.0661557 -0.0065476 0.0545697 0.0495852 -0.0425699 0.0646576 -0.0202982 -0.1028717 -0.0778524 -0.0020553 0.042047 0.1151982 0.0020931 -0.0078078 -0.0000186 0.1093944 unknown
polarizability: 194.9470947|5.044841|174.4701781|5.2232864|-5.3105066|72.6494892 unknown
InChI: InChI=1S/C11H10Cl2O2/c1-5-3-9(14)10-6(2)7(12)4-8(13)11(10)15-5/h4-5H,3H2,1-2H3
charge 0 multiplicity 1
25 atoms
Cl 0.040612 3.51713 -0.251305
Cl -4.204557 0.015237 -0.164783
O  1.711326 1.10229 0.025113
O  0.632933 -2.935083 0.106147
C  2.652405 0.051773 0.536121
C  2.362332 -1.259515 -0.198681
C  -0.108302 -0.608531 0.012746
C  0.909371 -1.704122 0.003079
C  0.371047 0.745742 -0.038295
C  -1.524832 -0.886723 -0.011053
C  4.055723 0.60965 0.32503
C  -0.554229 1.809799 -0.16728
C  -2.387107 0.226876 -0.122664
C  -1.929693 1.558983 -0.211675
C  -2.06861 -2.296956 0.065189
H  2.432681 -0.062288 1.618984
H  3.024467 -2.069111 0.151745
H  2.543997 -1.117623 -1.283713
H  4.158528 1.5899 0.819995
H  4.80551 -0.079099 0.753219
H  4.266489 0.737807 -0.750834
H  -2.63848 2.385886 -0.300517
H  -1.674898 -2.920212 -0.755933
H  -1.740388 -2.798197 0.991443
H  -3.167725 -2.29371 0.023823
