program: Gaussian 09
title: 000273132
version: EM64L-G09RevD.01
frameworkgroup: C1[X(C8H6ClNOS)]
method: RPBEPBE
basis: SDD
operation: Freq
keyword: #p
keyword: freq=noraman
keyword: PBEPBE/SDD
title: #p freq=noraman PBEPBE/SDD
converged: YES YES NO YES
title: Mulliken charges:
elementType: Cl S O N C C C C C C C C H H H H H H
charge: 0.039761 0.303725 -0.260038 0.096586 -0.347961 0.341027 -0.390001 0.335658 -0.290789 -0.344153 -0.430994 -0.538417 0.261529 0.262913 0.260213 0.224887 0.224895 0.251160
chargesum: 0.00000
title: Mulliken charges with hydrogens summed into heavy atoms:
elementType: Cl S O N C C C C C C C C
charge: 0.039761 0.303725 -0.260038 0.096586 -0.347961 0.341027 -0.128472 0.335658 -0.027876 -0.083940 -0.430994 0.162524
polarizability: 2.08429633e+02 3.77363648e+00 1.18482095e+02 2.87055415e-03 -1.85921935e-04 4.98628148e+01
1716.lowfreq: -0.0014 0.0006 0.0012 4.3967 5.7331 6.1869 63.2294 108.6377 147.9560
frequency: 63.2167 108.6262 147.9552 187.5596 194.5409 226.0642 252.6547 322.2893 362.8185 362.8474 434.0072 435.8801 501.7771 522.1329 534.4886 598.9999 601.0530 669.9821 731.0101 778.0125 824.7425 837.1652 850.2832 911.4217 963.6861 989.0498 1027.8939 1111.8090 1116.4873 1156.2752 1197.5962 1248.6599 1266.9843 1368.8264 1417.8630 1434.0369 1460.2600 1468.4225 1473.7634 1498.9454 1566.3622 1613.4426 2962.4340 3051.7527 3131.2516 3163.9387 3174.0760 3184.0320
redmass: 6.3261 4.8016 5.9851 3.3217 3.6703 5.6846 1.4932 15.4036 7.2428 7.6247 3.0447 6.8740 8.2890 11.6339 5.1341 11.0493 3.4319 7.6233 4.1179 6.8260 1.3819 1.6384 7.8653 9.6633 1.3385 5.1940 3.3936 1.2607 1.3292 1.3607 2.4061 7.1199 1.3899 4.8189 2.9710 1.6570 2.2381 1.0496 1.0965 11.1980 7.5772 7.0007 1.0330 1.1042 1.0995 1.0884 1.0916 1.0979
irintensity: 0.8999 2.9798 1.1821 0.8383 6.7984 3.2115 0.2219 2.5653 0.8260 1.3184 6.9446 1.0375 17.5654 0.6317 4.4794 31.4687 6.4043 1.0191 0.4194 21.0935 3.5835 76.7337 63.6935 133.8567 0.0972 38.9981 7.4847 0.1351 7.6489 1.4350 113.6925 98.5604 7.5665 5.6390 9.5043 67.0806 132.4223 14.7321 13.1251 90.4141 14.2072 162.8836 56.6787 45.5340 21.7997 1.3552 3.4316 4.5396
temp: 298.150 k
press: 1.00000 atm
elementType: 17 16 8 7 6 6 6 6 6 6 6 6 1 1 1 1 1 1
symmnumber: 1
zpe: 320045.2 jmol-1
zpe.correction: 0.121899 hartree
zpe.thermalcorrener: 0.132492 hartree
zpe.thermalcorrenthalpy: 0.133437 hartree
zpe.thermalcorrgfe: 0.084993 hartree
zpe.sumelectzpe: -1295.671189 hartree
zpe.sumelectthermal: -1295.660596 hartree
zpe.sumelectthermalent: -1295.659651 hartree
zpe.sumelectthermalfe: -1295.708095 hartree
dipole: 3.4983 -2.3070 -0.0005
dipole: 4.1905
quadrupole: -79.0076 -77.7177 -86.1605
quadrupole: -4.7647 0.0023 0.0002
quadrupole: 1.9543 3.2442 -5.1986 -4.7647 0.0023 0.0002
hfenergy: -1295.793088 hartree
pointgroup: C01 [X(C8H6Cl1N1O1S1)]
dipole: 1.3925766 0.8825484 0.0002046 debye
dipolederiv: -1.0180039 0.0405059 0.0000022 0.0492862 -0.0909103 -0.0000113 0.0011637 -0.0001044 -0.0010965 -0.4650174 -0.1122839 0.0000194 -0.0457445 -0.3343152 -0.0001138 0.0003707 -0.0004235 0.1355109 -1.7575778 -0.4312449 0.000094 -0.4934211 -0.4964668 0.0000258 0.0000797 0.0000215 -0.2980894 -0.4842198 0.1870015 0.0003045 0.235524 -0.7933391 -0.0003131 0.0004148 0.000438 -0.1098838 0.5325978 -0.1714175 -0.0002653 -0.3076 0.1239591 0.0001299 -0.0001633 -0.0000021 -0.0871175 0.0395369 -0.0691591 -0.00014 0.0638318 -0.1050943 -0.0000357 0.0004633 -0.0001672 0.0208528 -0.5631959 -0.0108018 0.0001042 0.3609055 -0.0539149 -0.0000382 -0.0001076 0.0000794 -0.1761361 1.6277793 0.3481753 -0.0001008 0.182496 0.2086543 0.0000367 -0.0000976 -0.0000369 0.1082106 0.31026 -0.043133 0.0000649 -0.0387101 0.1300693 -0.0000877 -0.0001095 0.0000191 -0.119821 -0.3599664 -0.0925093 -0.0000485 -0.4169667 -0.0644385 -0.0000426 0.0000612 -0.0000032 -0.1837337 1.4841993 0.1199322 -0.0000451 0.0625099 0.978254 0.0004227 -0.0020611 0.0001957 -0.0909522 0.4817053 0.1462901 -0.000019 0.588866 0.5252903 -0.0000352 -0.0000637 -0.0000248 0.327272 0.0811309 -0.0254995 0.0000149 -0.0698211 -0.0205692 0.0000122 0.000029 -0.0000233 0.176244 0.0762629 -0.0566857 0.0000142 -0.0192306 -0.0283248 0.0000267 -0.0000257 0.0000118 0.1670874 0.0161159 0.0845816 0.000003 0.0727911 0.0332397 0.0000177 0.0000236 0.0000193 0.1744701 0.0778227 0.0569742 0.0938781 -0.1179152 -0.049636 -0.0785178 0.0267408 -0.0989943 -0.0844077 0.0778299 0.0569532 -0.0938823 -0.1179232 -0.0496028 0.078518 -0.0267149 0.0989903 -0.0844381 -0.15726 -0.0276792 0.0000014 0.0111221 0.0871452 0.0000057 -0.0000036 0.0000044 0.1260282 unknown
polarizability: 208.2632101|-5.4020316|118.6485173|-0.0028735|-0.0001338|49.8628148 unknown
InChI: InChI=1S/C8H6ClNOS/c1-11-5-2-3-6-7(4-5)12-8(9)10-6/h2-4H,1H3
charge 0 multiplicity 1
18 atoms
Cl -4.578738 0.363963 0.000142
S  -1.758872 1.70447 0.000411
O  3.358182 0.035357 -0.000102
N  -2.178657 -0.964123 0.000184
C  -0.331774 0.577125 -0.00002
C  -0.778511 -0.782964 0.000178
C  1.033165 0.921635 -0.000095
C  1.969716 -0.141959 -0.000067
C  0.181322 -1.82541 0.0003
C  1.544523 -1.503224 0.000135
C  -2.803111 0.176266 -0.00067
C  3.872203 1.408143 -0.000214
H  1.352854 1.966245 -0.000106
H  -0.157872 -2.864969 0.000458
H  2.312432 -2.281586 0.000192
H  3.549273 1.957262 0.905486
H  3.5493 1.957105 -0.906019
H  4.966669 1.304362 -0.000191
