program: Gaussian 09
title: 000273120
version: EM64L-G09RevD.01
frameworkgroup: C1[X(C12H9N)]
method: RPBEPBE
basis: SDD
operation: Freq
keyword: #pfreq=noraman
keyword: PBEPBE/SDD
title: #p freq=noraman PBEPBE/SDD
converged: YES YES NO YES
title: Mulliken charges:
elementType: N C C C C C C C C C C C C H H H H H H H H H
charge: -0.030262 0.188661 0.429597 0.154922 0.326754 -0.452390 -0.438426 -0.356619 -0.429952 -0.804598 -0.240048 -0.241195 -0.286692 0.242244 0.239701 0.258525 0.242996 0.248146 0.233394 0.248148 0.234208 0.232884
chargesum: 0.00000
title: Mulliken charges with hydrogens summed into heavy atoms:
elementType: N C C C C C C C C C C C C
charge: -0.030262 0.188661 0.429597 0.154922 0.326754 -0.210146 -0.198724 -0.098094 -0.186955 -0.074911 -0.005840 -0.008311 -0.286692
polarizability: 1.92349536e+02 3.65480580e-01 1.59808897e+02 -4.18770194e-03 3.71747234e-03 5.63237136e+01
1716.lowfreq: -7.2573 -0.0003 0.0003 0.0009 5.0181 9.8172 51.7807 93.9121 120.8780
frequency: 51.7692 93.9113 120.8779 128.1553 197.0121 257.6934 275.6524 385.4723 389.8307 423.3663 453.9966 458.6852 511.6239 532.5283 587.3735 588.4522 666.9346 680.1751 718.8335 761.0499 801.2011 836.0390 844.8241 893.1549 915.5802 963.6315 983.0944 998.4568 1008.5110 1030.6825 1044.0983 1066.5594 1154.2572 1174.4899 1188.3403 1238.8146 1249.8518 1279.4624 1348.7874 1397.6541 1402.7326 1416.3742 1429.7053 1461.4648 1466.3879 1472.3081 1518.1131 1572.3437 1596.8789 1630.2978 2163.1011 2984.1675 3062.2115 3096.0500 3125.4644 3126.7761 3134.6103 3148.9147 3151.7237 3166.6840
redmass: 1.0439 4.4255 3.7508 9.0927 4.3367 3.3089 3.9866 3.9072 4.5769 6.1853 3.4975 6.8774 3.2396 6.5221 3.7107 5.7451 5.9761 4.0576 5.8479 1.2685 2.5857 1.3323 5.0696 1.7808 3.6777 1.3444 1.4029 1.3485 2.0840 2.2224 1.5665 2.5736 1.3802 1.1531 1.5018 1.8071 2.7937 1.7720 3.1011 1.9135 2.0482 2.4246 4.3893 2.3900 1.0434 1.1610 3.4900 7.0827 6.2058 6.5873 12.6323 1.0376 1.0971 1.0993 1.0870 1.0869 1.0884 1.0952 1.0971 1.1005
irintensity: 1.1631 2.8009 0.2191 3.7264 0.6502 2.1969 0.0087 1.0511 0.4783 0.0441 15.7642 0.1826 0.0993 0.5330 3.8363 0.3893 2.2851 8.1526 1.1427 35.5728 14.4352 61.0660 0.1021 6.2565 3.3977 0.7778 3.6365 0.0523 0.0953 5.1021 7.5706 2.4771 2.0288 2.1575 5.1302 7.1361 5.9163 5.9737 2.0091 12.4389 11.7215 2.0661 3.5454 1.1765 15.9315 7.4565 26.6856 0.5037 14.3605 5.9984 39.8720 15.1672 10.7890 17.9389 0.8655 4.1381 2.3643 16.5354 28.6668 26.9300
temp: 298.150 k
press: 1.00000 atm
elementType: 7 6 6 6 6 6 6 6 6 6 6 6 6 1 1 1 1 1 1 1 1 1
symmnumber: 1
zpe: 447566.0 jmol-1
zpe.correction: 0.170469 hartree
zpe.thermalcorrener: 0.181122 hartree
zpe.thermalcorrenthalpy: 0.182066 hartree
zpe.thermalcorrgfe: 0.133764 hartree
zpe.sumelectzpe: -516.554096 hartree
zpe.sumelectthermal: -516.543443 hartree
zpe.sumelectthermalent: -516.542499 hartree
zpe.sumelectthermalfe: -516.590801 hartree
dipole: 1.8535 -3.8908 -0.0004
dipole: 4.3097
quadrupole: -66.9680 -76.7201 -79.6967
quadrupole: 10.3744 0.0005 -0.0010
quadrupole: 7.4936 -2.2585 -5.2351 10.3744 0.0005 -0.0010
hfenergy: -516.7245652 hartree
pointgroup: C01 [X(C12H9N1)]
dipole: 0.814398 1.4871863 0.0001401 debye
dipolederiv: -0.3289206 -0.0996355 0.0000329 -0.1629645 -0.4021958 0.0000533 -0.000011 -0.0000019 -0.2509374 0.1822487 0.0188125 0.0000058 -0.1992445 -0.0866791 -0.0000092 0.0000028 0.0000215 0.0068857 -0.0068075 -0.0531416 -0.0000009 0.038626 -0.2017824 -0.0000036 -0.000004 -0.0000065 0.0572987 -0.065845 -0.0324443 -0.0000072 -0.0484655 -0.1508796 -0.0000103 -0.0000012 -0.0000082 0.0538026 0.431758 -0.1017298 0.0000066 0.2156803 0.0687852 0.0000052 0.0000415 0.0000139 -0.0081376 0.1732927 0.0357554 0.0000074 -0.0926833 0.1382164 0.0000034 0.000005 0.0000084 -0.1405808 -0.3769233 -0.0749508 -0.0000072 -0.1869366 0.0986844 -0.0000016 -0.0000058 -0.0000053 -0.1763505 -0.1419478 0.0477646 -0.0000033 0.0619663 0.0707551 0.0000004 0.0000005 0.0000008 -0.1383775 0.0638161 0.0202582 0.0000054 0.1106029 0.0928409 0.0000055 0.0000088 0.000001 -0.1727259 -0.2236963 -0.0013708 -0.0000077 -0.1217331 0.1240111 0.0000004 -0.0000311 0.0000139 0.0429904 -0.050113 -0.0374944 0.0000035 -0.0461391 0.1737823 0.0000021 0.000001 0.0000013 -0.1505678 0.1115183 0.0639749 0.0000059 0.0827707 -0.1203042 0.0000007 0.0000092 0.0000028 -0.1547797 0.1186044 0.2124704 -0.0000211 0.2831932 0.3568556 -0.0000317 -0.0000055 -0.0000189 0.0184865 0.0263746 -0.1092675 -0.0000043 -0.0506778 -0.0474634 -0.0000042 -0.0000015 -0.0000042 0.1509833 0.0172381 0.1102988 -0.0000007 0.0762799 -0.0554823 -0.0000022 -0.0000056 -0.0000038 0.1553001 0.0608727 -0.08655 0.0000001 -0.0361176 -0.0131382 -0.0000023 -0.000001 -0.0000028 0.1549751 0.0379534 -0.0397892 -0.0000032 -0.1092244 -0.0671411 -0.0000049 -0.0000054 -0.0000044 0.1560453 0.0129866 0.0097735 0.0302291 -0.0246644 0.0555674 0.0960577 0.0765611 0.0626174 -0.0191293 0.0579693 0.0227605 0.000001 0.1328006 -0.1226743 -0.0000143 0.0000101 -0.0000134 0.1123291 0.0129867 0.0097849 -0.0302321 -0.0246523 0.0555882 -0.0960449 -0.0765574 -0.0626111 -0.0191535 0.0231294 0.0881835 -0.0000027 0.1006897 -0.0599613 0.0000009 -0.000003 0.0000001 0.1586881 -0.1364956 -0.0034632 -0.0000071 0.0008934 0.0926151 -0.0000003 -0.0000074 -0.0000004 0.1629552 unknown
polarizability: 192.2049047|-2.1952315|159.9535284|0.0043907|0.0034754|56.3237136 unknown
InChI: InChI=1S/C12H9N/c1-9-6-7-10-4-2-3-5-11(10)12(9)8-13/h2-7H,1H3
charge 0 multiplicity 1
22 atoms
N  -2.370458 -2.580548 -0.000324
C  0.400564 -0.317224 -0.000033
C  1.105696 0.94602 -0.000003
C  -1.046858 -0.301221 -0.00006
C  -1.776939 0.91104 -0.000054
C  0.348874 2.162102 -0.000003
C  -1.046846 2.14143 -0.000026
C  1.158462 -1.533181 -0.000024
C  2.539516 0.948525 0.000027
C  -3.293083 0.917397 -0.000079
C  2.55542 -1.499472 0.000006
C  3.253909 -0.250614 0.000031
C  -1.764562 -1.54783 -0.000074
H  0.8845 3.118772 0.000022
H  -1.608156 3.082249 -0.000022
H  0.629214 -2.492619 -0.000038
H  3.066418 1.909978 0.000049
H  -3.697578 0.394312 0.886198
H  -3.685878 1.947275 -0.000018
H  -3.697545 0.394432 -0.886443
H  3.12339 -2.436007 0.000012
H  4.349042 -0.241817 0.000056
