program: Gaussian 09
title: 000273206
version: EM64L-G09RevD.01
frameworkgroup: C1[X(C19H21FN6O4S)]
method: RPBEPBE
basis: SDD
operation: Freq
keyword: #p
keyword: freq=noraman
keyword: PBEPBE/SDD
title: #p freq=noraman PBEPBE/SDD
converged: YES YES NO NO
title: Mulliken charges:
elementType: S F O O O O N N N N N N C C C C C C C C C C C C C C C C C C C H H H H H H H H H H H H H H H H H H H H H
charge: 1.083409 -0.343310 -0.336894 -0.235233 -0.482398 -0.473426 -0.312962 -0.095057 -0.172940 -0.633188 -0.613956 -0.458794 0.188271 -0.684745 -0.705125 0.322375 0.228316 -0.022027 -0.354246 -0.306966 -0.342354 -0.389202 0.416091 -0.387437 0.543632 0.125601 -0.049320 -0.451732 -0.339841 -0.254589 -0.186614 0.238109 0.232610 0.206468 0.243329 0.204065 0.227589 0.262754 0.262778 0.255238 0.250778 0.335388 0.337679 0.316686 0.320808 0.255481 0.253589 0.374459 0.286442 0.319668 0.290403 0.250338
chargesum: 0.00000
title: Mulliken charges with hydrogens summed into heavy atoms:
elementType: S F O O O O N N N N N N C C C C C C C C C C C C C C C C C C C
charge: 1.083409 -0.343310 -0.336894 -0.235233 -0.482398 -0.473426 -0.312962 -0.095057 -0.172940 0.039879 0.023538 -0.084336 0.188271 -0.007557 -0.030142 0.322375 0.228316 -0.022027 -0.091492 -0.044188 -0.087116 -0.138424 0.416091 0.121633 0.543632 0.125601 -0.049320 -0.165290 -0.020174 0.035814 0.063724
polarizability: 4.61245211e+02 4.96152432e+00 2.82894848e+02 9.88023400e-01 5.79765218e+00 1.90504999e+02
1716.lowfreq: -4.2148 -1.3711 -0.0018 -0.0013 -0.0005 3.2957 10.0776 12.7642 17.1872
frequency: 9.8097 12.6092 17.0676 20.8033 26.9706 40.6372 50.2814 65.9637 75.6555 84.1074 100.9443 106.9931 123.5724 135.0221 148.0864 167.6087 188.0936 193.3943 197.4703 211.9755 219.9054 229.8433 246.7470 261.6649 272.5033 285.8854 304.0403 304.9145 313.0633 317.0273 332.0878 369.3757 376.6167 380.4268 382.8041 407.4101 414.8463 420.7662 433.4229 443.6667 445.8411 491.1669 496.8153 517.4126 519.8268 528.8769 533.3920 539.5372 552.0580 554.8175 569.4704 599.1841 609.6811 634.8192 643.4909 668.2813 680.1314 683.7117 708.3977 722.6777 726.7825 779.9153 802.0439 805.9899 813.3133 819.0434 830.4663 845.1965 860.5515 864.9751 889.7832 909.2432 930.5254 934.2251 945.7976 951.0724 954.9420 967.8510 972.5468 988.6128 994.0882 997.4906 1003.0053 1004.5658 1009.8526 1049.1257 1066.3513 1092.6865 1104.8821 1110.2553 1118.9742 1130.1008 1174.4878 1180.6484 1191.7643 1201.8905 1206.6946 1215.1046 1244.2486 1257.1098 1276.4981 1294.4600 1311.4437 1337.5165 1359.3439 1364.1863 1376.2285 1385.0658 1402.2765 1412.5766 1429.2070 1447.3072 1448.5938 1452.5969 1459.1356 1469.0891 1476.8684 1477.7791 1492.1831 1521.4782 1531.6456 1569.2921 1574.2332 1575.9940 1604.7442 1615.4098 1617.3731 1617.7936 1633.9091 2980.6035 2983.0966 2996.7510 3047.2983 3080.7568 3094.5823 3098.9245 3110.1133 3144.2555 3148.8647 3149.8594 3157.7523 3167.3007 3171.4651 3178.1099 3192.8822 3450.3134 3554.5308 3568.0378 3709.7931 3730.2511
redmass: 8.3068 4.9633 5.7237 8.3816 6.1717 5.5863 4.7872 7.1232 5.9413 6.1364 6.8967 8.8069 4.4921 5.1005 2.6440 6.7292 5.7322 5.7535 9.6976 1.1628 7.8441 4.7496 6.7706 4.1021 1.0378 3.6141 2.8552 8.2043 2.8825 12.5259 3.7647 1.3522 1.3605 3.6781 2.8609 4.9961 5.2544 3.0040 7.9626 4.0110 4.3847 2.3408 2.3609 5.2979 1.1680 1.5041 5.1375 7.0237 4.2984 2.8864 6.9128 3.8149 4.9871 6.8396 6.4862 6.2942 6.3743 2.4962 5.5927 5.5925 6.8438 1.1572 1.3189 3.7102 5.3395 1.3291 1.7041 8.1039 10.2746 2.8464 1.5246 1.5842 4.5239 1.3602 1.6938 4.3548 1.7620 1.3473 5.3779 1.3423 15.0436 6.8651 2.5191 1.8372 1.3455 3.5174 2.1931 1.5557 1.9458 1.3129 2.2262 2.0424 1.1997 1.0915 3.4446 1.0727 2.9982 3.5422 4.3313 1.6024 4.3303 1.3564 1.5421 1.5775 3.5841 1.2403 4.7457 1.2714 4.0665 3.5865 3.6078 4.0949 1.0531 1.1180 1.0979 1.0687 1.0674 2.5188 2.4929 2.5773 2.5502 1.7212 4.4711 7.2895 2.4693 3.6933 2.7434 5.8515 6.4293 1.0347 1.0556 1.0356 1.1064 1.1001 1.0999 1.1006 1.0992 1.0927 1.0884 1.0881 1.0886 1.0967 1.0975 1.0956 1.0968 1.0765 1.0443 1.0437 1.1053 1.1058
irintensity: 0.0787 0.4562 0.1495 0.4265 0.0203 1.2649 1.2059 3.3906 1.5288 0.1544 6.2620 0.5419 1.8841 2.0387 13.5982 2.5458 2.3209 4.2388 1.3083 0.9439 1.8561 10.3262 5.1247 0.3258 0.7376 3.4393 12.6243 10.0649 2.0576 6.3742 11.8471 0.2478 311.9405 25.9528 48.3584 18.1470 0.7123 2.9166 47.4548 40.7431 5.9167 56.9721 7.4755 6.8749 3.3612 44.6737 71.6315 54.8091 23.0620 21.0059 49.9430 3.8649 0.9721 1.6570 3.3109 0.6604 15.4058 29.7436 17.8306 14.1499 24.9807 66.1834 39.8731 75.7070 3.9574 15.8695 57.4717 59.2457 53.5045 0.2452 52.1598 1.8831 10.3617 3.4438 4.9953 5.9152 1.0044 0.4918 4.5230 5.1364 122.5330 29.0757 45.9835 5.0422 2.6153 10.3336 9.2352 19.0684 4.7038 22.3791 2.5825 53.0109 76.9130 0.8007 33.4949 3.1480 462.8001 42.1853 48.0677 1.4656 29.3339 3.5091 43.2157 1.9009 5.4519 33.1126 78.6535 26.0925 464.4012 9.0150 47.6440 130.9306 1.1706 104.5499 10.2201 9.2400 29.2643 35.7484 497.7194 486.2057 221.7220 194.7753 216.3386 6.8943 548.6374 96.5079 496.6342 95.3366 182.0533 16.8416 21.3452 18.7867 10.8274 28.1202 13.2737 34.3224 29.7433 7.7382 7.5816 15.4129 7.5782 6.4659 1.6397 9.8914 6.0063 187.7419 56.7767 91.1073 55.3340 37.8651
temp: 298.150 k
press: 1.00000 atm
elementType: 16 9 8 8 8 8 7 7 7 7 7 7 6 6 6 6 6 6 6 6 6 6 6 6 6 6 6 6 6 6 6 1 1 1 1 1 1 1 1 1 1 1 1 1 1 1 1 1 1 1 1 1
symmnumber: 1
zpe: 1020352.7 jmol-1
zpe.correction: 0.388632 hartree
zpe.thermalcorrener: 0.419390 hartree
zpe.thermalcorrenthalpy: 0.420334 hartree
zpe.thermalcorrgfe: 0.322326 hartree
zpe.sumelectzpe: -1861.518885 hartree
zpe.sumelectthermal: -1861.488127 hartree
zpe.sumelectthermalent: -1861.487183 hartree
zpe.sumelectthermalfe: -1861.585191 hartree
dipole: -2.0419 5.0088 -2.0919
dipole: 5.7995
quadrupole: -227.0106 -204.8355 -189.6807
quadrupole: 25.7883 7.4393 -0.7360
quadrupole: -19.8350 2.3400 17.4949 25.7883 7.4393 -0.7360
hfenergy: -1861.9075166 hartree
pointgroup: C01 [X(C19H21F1N6O4S1)]
dipole: 0.5084472 -2.1773234 -0.4548285 debye
polarizability: 458.9308781|-20.2012641|279.6792135|-9.8238253|-21.3340917|196.0349656 unknown
InChI: InChI=1S/C19H21FN6O4S/c1-19(2)25-17(21)24-18(22)26(19)13-6-8-14(9-7-13)30-11-16(27)23-12-4-3-5-15(10-12)31(20,28)29/h3-10,23H,11,21-22H2,1-2H3
charge 0 multiplicity 1
52 atoms
S  -6.464865 3.195505 -0.539113
F  -6.400636 3.922322 1.168713
O  -0.703569 -0.931547 0.177744
O  -3.498825 -3.114924 0.935756
O  -5.182943 3.784095 -1.3107
O  -7.966246 3.425795 -1.059048
N  4.908298 -0.188004 -0.303419
N  7.131174 0.032389 0.778076
N  6.906406 -0.363446 -1.635768
N  4.823953 -0.700247 -2.625138
N  8.975426 -0.499849 -0.569058
N  -3.279766 -0.83716 0.339271
C  5.727241 0.460485 0.842597
C  5.64299 2.005677 0.690154
C  5.14894 0.011043 2.197859
C  3.488987 -0.395079 -0.187975
C  5.575104 -0.401615 -1.505169
C  7.622374 -0.248899 -0.422925
C  2.983183 -1.668381 0.172872
C  2.570344 0.664034 -0.429768
C  1.595303 -1.890961 0.304729
C  1.18422 0.456982 -0.299598
C  0.700373 -0.819719 0.070524
C  -1.272592 -2.226597 0.563483
C  -4.622534 -0.393113 0.314517
C  -2.801648 -2.105247 0.631666
C  -6.182099 1.408092 -0.059204
C  -4.855431 0.964039 -0.033229
C  -5.727058 -1.238466 0.621947
C  -7.303146 0.616451 0.232541
C  -7.041958 -0.730538 0.574079
H  6.284362 2.47569 1.455588
H  6.012522 2.312284 -0.304668
H  4.608673 2.371759 0.827436
H  5.780804 0.444947 2.989946
H  4.108403 0.349907 2.343211
H  5.195933 -1.087162 2.290744
H  3.690276 -2.484166 0.353764
H  2.950485 1.648264 -0.72146
H  1.236617 -2.884666 0.588493
H  0.472441 1.268117 -0.481315
H  5.338665 -0.917548 -3.474633
H  3.809004 -0.654751 -2.624462
H  9.582689 -0.430725 0.241997
H  9.324021 -0.795814 -1.475472
H  -0.90381 -2.54221 1.55891
H  -1.018562 -3.009345 -0.177465
H  -2.539785 -0.158359 0.116354
H  -4.034068 1.644373 -0.285253
H  -5.53683 -2.279985 0.888405
H  -8.317898 1.021382 0.188101
H  -7.879643 -1.394009 0.810261
