program: Gaussian 09
title: 000273116
version: EM64L-G09RevD.01
frameworkgroup: C1[X(C12H15NO6)]
method: RPBEPBE
basis: SDD
operation: Freq
keyword: #p
keyword: freq=noraman
keyword: PBEPBE/SDD
title: #p freq=noraman PBEPBE/SDD
converged: NO YES NO NO
title: Mulliken charges:
elementType: O O O O O O N C C C C C C C C C C C C H H H H H H H H H H H H H H H
charge: -0.266689 -0.419229 -0.294289 -0.381807 -0.214467 -0.487352 -0.157663 -0.154057 -0.492374 -0.512716 -0.411640 -0.529743 0.166883 0.169108 0.055364 0.343594 0.138457 -0.417663 -0.438013 0.263715 0.296179 0.248084 0.273385 0.236083 0.241709 0.234347 0.272821 0.273337 0.405245 0.260625 0.240679 0.247725 0.400962 0.409401
chargesum: 0.00000
title: Mulliken charges with hydrogens summed into heavy atoms:
elementType: O O O O O O N C C C C C C C C C C C C
charge: -0.266689 -0.013985 -0.294289 0.019156 -0.214467 -0.077951 -0.157663 0.109657 0.051889 -0.003247 0.064417 0.016415 0.166883 0.169108 0.055364 0.343594 0.138457 -0.157038 0.050391
polarizability: 1.81250870e+02 2.34799127e+00 1.61505321e+02 1.60975266e+01 -1.19420601e+01 1.15550617e+02
1716.lowfreq: -14.6040 -10.9801 -0.0009 -0.0003 0.0004 9.6769 56.9536 71.4315 84.2457
frequency: 56.9135 71.2921 84.2405 109.7789 117.9374 133.9084 143.5074 178.7892 184.6901 203.4633 245.4451 274.9242 279.3863 289.5742 309.2920 316.1148 354.8293 387.0490 422.0418 451.8274 460.7809 513.7413 535.6557 570.4671 575.4560 614.4247 623.3507 643.2945 659.1794 685.3616 738.4514 750.3611 756.9695 772.9630 803.4226 835.9715 866.5158 881.9388 885.8854 907.7168 930.4028 935.5665 945.7826 959.9228 975.8712 990.1184 1001.7681 1021.6543 1042.5340 1080.5210 1094.4324 1118.9278 1150.0912 1161.3638 1172.7767 1181.6180 1190.5220 1202.5856 1207.4791 1248.2230 1272.4682 1284.0149 1291.1473 1298.0763 1317.4837 1318.4958 1328.8329 1335.0974 1348.9421 1372.1973 1436.2800 1454.2340 1459.8608 1468.3115 1474.4390 1476.5264 1485.8948 1571.0129 1597.9190 1622.2688 1637.3644 2889.2244 2914.6640 2983.6414 3006.6750 3016.6827 3025.4831 3031.2307 3039.3624 3046.9463 3082.0702 3098.0146 3119.1987 3125.2745 3171.4177 3398.3607
redmass: 7.3670 4.9603 7.3036 7.8314 5.4110 5.3655 6.5194 3.8159 6.3410 4.7378 2.8233 3.9525 3.5204 3.0300 6.5413 3.7059 4.4784 6.0445 3.1704 3.3778 5.8414 5.7531 4.9187 4.0402 4.7575 4.1506 2.2918 2.1307 2.8407 3.7242 4.1625 5.4049 5.1908 4.1492 3.7297 1.7664 1.5422 1.1774 3.3636 2.7913 4.9109 2.2651 1.5149 2.7036 1.8668 2.0367 2.1098 2.5910 2.4400 2.8244 2.7814 4.6783 1.6231 1.4460 1.2995 1.8554 1.5945 1.6961 1.4237 1.5380 1.5154 1.4322 1.2332 1.7450 1.2605 1.7746 1.4074 1.8866 1.3002 1.6419 1.5526 1.1027 1.5782 1.1022 1.1023 1.1055 1.1140 10.2063 7.6334 3.7220 6.8695 1.0692 1.0691 1.0576 1.0668 1.0609 1.0635 1.0696 1.1040 1.0827 1.1024 1.1054 1.0986 1.1004 1.0928 1.0672
irintensity: 3.4526 2.1760 4.3648 1.0013 1.6103 5.8789 2.2464 1.8089 8.6087 9.6751 3.5443 30.9618 4.8814 11.2200 0.0279 8.5310 1.5853 1.1467 8.7923 8.0002 3.3316 4.8477 10.8518 6.1297 27.4278 9.6762 78.9089 93.8211 122.9726 0.8536 6.5322 2.8493 17.9267 16.0740 16.0009 4.7585 34.6719 113.3762 35.1149 10.9269 146.2693 11.1223 68.2420 11.0227 84.8801 10.2915 40.1323 28.7743 47.6274 5.4083 20.9825 61.4454 81.2260 55.7602 50.6467 41.1838 58.3751 9.5287 19.2457 70.9979 11.4494 15.9285 3.7826 26.2453 22.6582 46.7573 12.4333 67.0772 11.8323 13.6253 20.2233 9.6461 71.3865 17.3765 6.5095 29.9260 9.1052 137.6289 30.6977 117.8654 189.5459 437.7284 832.8910 26.7870 16.7565 24.4033 30.0450 13.4554 3.2837 13.0587 9.8354 28.5772 8.3567 5.9834 0.9314 150.3859
temp: 298.150 k
press: 1.00000 atm
elementType: 8 8 8 8 8 8 7 6 6 6 6 6 6 6 6 6 6 6 6 1 1 1 1 1 1 1 1 1 1 1 1 1 1 1
symmnumber: 1
zpe: 694481.2 jmol-1
zpe.correction: 0.264514 hartree
zpe.thermalcorrener: 0.281253 hartree
zpe.thermalcorrenthalpy: 0.282198 hartree
zpe.thermalcorrgfe: 0.221083 hartree
zpe.sumelectzpe: -970.896307 hartree
zpe.sumelectthermal: -970.879567 hartree
zpe.sumelectthermalent: -970.878623 hartree
zpe.sumelectthermalfe: -970.939738 hartree
dipole: -4.4499 3.0919 -2.1257
dipole: 5.8207
quadrupole: -107.9470 -128.2543 -110.1478
quadrupole: 26.9075 -7.3327 2.7942
quadrupole: 7.5027 -12.8046 5.3019 26.9075 -7.3327 2.7942
hfenergy: -971.1608208 hartree
pointgroup: C01[X(C12H15N1O6)]
dipole: 1.9735674 -0.3583087 -1.1049257 debye
polarizability: 172.3634506|12.1284231|163.7876286|-23.9450075|10.0948408|122.1557288 unknown
InChI: InChI=1S/C12H15NO6/c14-6-8-3-9(15)11(16)10(19-8)5-13-2-1-7(4-13)12(17)18/h3,7,14,16-17H,1-2,4-6H2
charge 0 multiplicity 1
34 atoms
O  -0.841034 -0.845392 -1.125292
O  1.437631 -1.724163 1.112689
O  2.240186 -1.40124 -1.034668
O  -1.792528 2.316579 0.522858
O  -3.92933 0.532926 1.313032
O  0.162535 -3.354306 -0.548015
N  0.892123 2.061236 -0.08737
C  2.508908 0.384073 0.69067
C  1.228604 1.201364 1.096351
C  3.212048 1.309082 -0.35005
C  2.255746 2.550146 -0.498527
C  0.262242 1.310497 -1.252529
C  2.089682 -0.985979 0.150987
C  -0.908727 0.508383 -0.768857
C  -1.872661 1.004317 0.087163
C  -1.709741 -1.74738 -0.509084
C  -2.954014 0.123563 0.610728
C  -2.729934 -1.307908 0.295096
C  -1.280489 -3.159813 -0.834752
H  3.128429 0.202216 1.586264
H  0.390316 0.565064 1.410745
H  1.47443 1.88306 1.929187
H  3.334513 0.771503 -1.306286
H  4.213507 1.619635 -0.009373
H  2.555835 3.360957 0.188651
H  2.227806 2.958268 -1.522433
H  -0.05831 2.087804 -1.971442
H  0.974307 0.634988 -1.764462
H  0.952293 -2.526575 0.684769
H  -3.397795 -2.028709 0.775881
H  -1.466612 -3.400724 -1.899011
H  -1.820912 -3.880312 -0.203775
H  -0.83108 2.645017 0.368444
H  0.725226 -2.901778 -1.242488
