program: Gaussian 09
title: 000273066
version: EM64L-G09RevD.01
frameworkgroup: C1[X(C7H6N4O4)]
method: RPBEPBE
basis: SDD
operation: Freq
keyword: #pfreq=noraman
keyword: PBEPBE/SDD
title: #p freq=noraman PBEPBE/SDD
converged: YES YES NO NO
title: Mulliken charges:
elementType: O O O O N N N N C C C C C C C H H H H H H
charge: -0.156031 -0.357620 -0.294784 -0.217651 -0.436355 0.035072 0.030203 -0.646117 -0.041763 0.004437 0.202499 -0.260244 -0.263466 0.169492 0.281680 0.364169 0.259235 0.258476 0.326415 0.347728 0.394625
chargesum: 0.00000
title: Mulliken charges with hydrogens summed into heavy atoms:
elementType: O O O O N N N N C C C C C C C
charge: -0.156031 0.037006 -0.294784 -0.217651 -0.072186 0.035072 0.030203 0.028026 -0.041763 0.004437 0.202499 -0.001009 -0.004990 0.169492 0.281680
polarizability: 1.64740209e+02 -1.11446219e+01 1.34198374e+02 8.03913031e-01 -1.03154876e+00 6.02789130e+01
1716.lowfreq: -0.0007 -0.0004 -0.0002 1.1383 5.1426 7.2029 31.9797 38.5006 54.7079
frequency: 31.9757 38.4927 54.7063 78.8936 104.1605 126.0772 199.0733 221.2548 225.3093 262.0920 344.0450 381.5231 397.5316 413.7874 450.7570 485.4690 543.6305 547.8687 572.5825 593.2328 618.4102 644.6049 688.7539 713.7188 725.4394 787.3717 792.9424 822.3609 866.9405 884.5290 895.8842 953.0127 1005.2363 1045.2852 1065.7607 1087.3266 1162.7934 1188.6161 1244.3269 1266.5549 1303.1196 1326.6131 1385.6184 1395.9255 1464.3320 1513.3461 1514.3750 1587.2668 1616.9800 1646.9773 1700.5719 3147.5948 3170.2093 3322.3513 3505.6537 3527.4176 3686.5408
redmass: 7.8075 7.7513 5.3082 8.0101 7.3839 6.7216 6.4674 7.7857 10.9870 6.7558 6.9481 7.9492 5.2607 3.4456 1.2713 8.1198 4.3052 1.2185 4.5164 5.1478 1.4094 4.5257 7.6352 4.1228 5.1194 2.2815 2.5352 8.4334 1.3878 5.0694 4.0657 1.5711 6.8573 3.1981 2.0310 2.7626 2.5912 2.9385 4.9041 3.2599 3.7498 2.4661 3.4022 2.1002 4.0958 7.9239 2.1884 8.6333 1.2621 3.1157 5.4873 1.0890 1.0989 1.0809 1.0641 1.0461 1.1041
irintensity: 1.8862 3.3519 8.1781 6.6435 4.0951 2.3796 3.0600 1.6620 2.4751 2.7754 11.9364 9.9361 3.4954 0.6530 74.8537 11.3685 40.4158 183.1178 5.8338 49.3077 119.7028 35.2712 1.3479 39.4774 4.0295 187.5655 73.5648 19.0950 15.4099 41.0751 16.2360 1.6309 151.4150 7.5978 2.8259 151.5935 48.0449 40.9337 41.4302 117.8478 231.4204 32.0319 121.6422 11.8668 29.1337 10.4282 758.5350 150.2434 18.9734 118.4826 311.9450 0.5250 28.4257 238.3249 61.5026 45.9255 47.5787
temp: 298.150 k
press: 1.00000 atm
elementType: 8 8 8 8 7 7 7 7 6 6 6 6 6 6 6 1 1 1 1 1 1
symmnumber: 1
zpe: 366937.9 jmol-1
zpe.correction: 0.139759 hartree
zpe.thermalcorrener: 0.153261 hartree
zpe.thermalcorrenthalpy: 0.154205 hartree
zpe.thermalcorrgfe: 0.097711 hartree
zpe.sumelectzpe: -789.168594 hartree
zpe.sumelectthermal: -789.155093 hartree
zpe.sumelectthermalent: -789.154148 hartree
zpe.sumelectthermalfe: -789.210643 hartree
dipole: 3.6310 6.0415 -2.4337
dipole: 7.4570
quadrupole: -78.2465 -81.6188 -87.7676
quadrupole: -23.6889 2.6971 5.5395
quadrupole: 4.2978 0.9255 -5.2233 -23.6889 2.6971 5.5395
hfenergy: -789.3083535 hartree
pointgroup: C01 [X(C7H6N4O4)]
dipole: 1.5312163 -1.7913846 1.7474348 debye
dipolederiv: -0.6587863 0.0574244 -0.1348173 -0.1817738 -0.3746969 0.2089367 0.2237849 0.220403 -0.7026425 -0.5230005 0.457583 -0.0359487 0.5055309 -1.130616 -0.1224723 0.0228932 -0.1872708 -0.3245919 -0.9626313 0.0499701 0.2727107 0.0145289 -0.7488122 0.1640314 0.3243579 0.0111051 -0.5199111 -0.920154 0.1663782 -0.1387577 0.1509563 -0.6174139 0.2182151 -0.1999667 0.2076101 -0.4963403 -1.9645986 -0.2617831 0.4076015 -0.1942124 -0.5098303 0.166156 0.269715 0.2185681 -0.5746166 -0.266839 0.0211308 -0.0455617 -0.1762014 -0.2926002 -0.0517734 -0.0431392 -0.0454002 -0.2041684 -0.2666887 0.268795 -0.0859361 0.079667 -0.1053354 0.0071387 0.0999628 -0.0347613 -0.1844387 -0.653489 -0.3057654 0.2656464 -0.3859394 -0.8473785 0.134955 0.3211316 0.1437428 -0.911688 0.2507901 -0.024486 0.1260082 -0.083489 0.1321356 0.0655776 0.0929341 0.1107232 0.0266571 -0.1709277 -0.3283482 0.054073 0.0496784 -0.2517798 0.0539087 -0.0257291 0.1566493 0.0351331 1.3835346 0.1504416 -0.1057541 0.6563187 0.4484545 -0.4424276 -0.7379693 -0.4274251 0.9926565 -0.0060918 -0.0910378 0.0775124 0.3017621 0.447381 -0.014631 0.0704344 -0.0418411 0.039581 0.3624376 0.0749199 -0.0855112 -0.1910658 -0.3005287 0.0630262 -0.0900987 -0.0824438 0.0178645 1.0870365 -0.1942577 -0.4435076 -0.2594474 1.7805609 -0.1835213 -0.4650472 -0.0164276 0.5163903 2.3221577 0.2504591 -0.2523364 0.1457153 1.0805735 -0.607415 0.0411868 -0.5803416 0.8042387 0.3425897 -0.132073 0.0437959 -0.2874985 0.3589704 0.0544564 0.059403 -0.028701 0.2669588 0.0509981 -0.0607662 -0.0028782 -0.104404 -0.0199012 0.0097565 0.0142276 0.0565723 0.124156 -0.0782626 -0.0483594 0.0262667 -0.0091843 0.1038467 0.0117292 -0.0100378 0.0296045 0.1271142 0.2026591 0.0361916 -0.0266509 0.0509514 0.2299783 0.1154752 -0.0568305 0.0891103 0.3366254 0.2093487 0.0272293 -0.0273993 0.0121427 0.2645667 0.0990321 -0.007032 0.1026491 0.3172499 0.2599175 -0.113646 0.1114445 -0.0940358 0.3524255 0.0498457 0.095819 0.0978746 0.3137721 unknown
polarizability: 163.8244666|10.3017757|123.2579849|-7.0479487|-27.2750954|72.1350445 unknown
InChI: InChI=1S/C7H6N4O4/c8-7(15)11-5(12)3-4(6(13)14)10-2-1-9-3/h1-2,11,13H,8H2
charge 0 multiplicity 1
21 atoms
O  -1.166084 1.477736 -1.542073
O  1.683535 -2.626443 0.493364
O  -0.180005 -1.670993 1.461555
O  -3.876361 1.044878 -0.383534
N  -1.756472 0.297867 0.422726
N  1.200159 2.11657 -0.196131
N  2.796049 -0.174775 0.184949
N  -3.729198 -0.715985 1.142044
C  0.606812 0.890741 -0.03633
C  1.427599 -0.24418 0.283446
C  -0.874586 0.911326 -0.461087
C  2.551043 2.201025 -0.154698
C  3.354879 1.030724 -0.074996
C  0.888712 -1.545052 0.79571
C  -3.18819 0.270344 0.320936
H  -1.314996 -0.276274 1.160427
H  2.98803 3.203477 -0.198992
H  4.441792 1.060268 -0.196745
H  -3.165803 -1.418381 1.619566
H  -4.743916 -0.781781 1.177521
H  1.293401 -3.449694 0.897937
