program: Gaussian 09
title: 000273043
version: EM64L-G09RevD.01
frameworkgroup: C1[X(C13H16N2O2)]
method: RPBEPBE
basis: SDD
operation: Freq
keyword: #p
keyword: freq=noraman
keyword: PBEPBE/SDD
title: #p freq=noraman PBEPBE/SDD
converged: YES YES NO NO
title: Mulliken charges:
elementType: O O N N C C C C C C C C C C C C C H H H H H H H H H H H H H H H H
charge: -0.176200 -0.140503 -0.105407 -0.226190 -0.395072 0.313362 -0.315511 -0.314374 0.173042 0.043718 -0.052502 -0.300153 -0.680646 -0.675413 -0.336027 -0.199481 -0.249214 0.231165 0.248447 0.213613 0.194580 0.230393 0.197123 0.277676 0.209893 0.222635 0.220066 0.205155 0.230187 0.216674 0.269806 0.231389 0.237770
chargesum: 0.00000
title: Mulliken charges with hydrogens summed into heavy atoms:
elementType: O O N N C C C C C C C C C C C C C
charge: -0.176200 -0.140503 -0.105407 -0.226190 0.084540 0.313362 0.092682 0.113142 0.173042 0.043718 -0.052502 -0.022477 -0.028052 -0.023397 -0.066221 0.031908 -0.011444
polarizability: 1.89584612e+02 -4.59818140e-01 1.93284844e+02 -1.50788619e+01 6.31019788e+00 1.04564592e+02
1716.lowfreq: -11.5943 -9.4071 -0.0005 0.0006 0.0007 2.4337 26.0238 40.7564 49.6110
frequency: 25.7040 40.7412 49.5520 75.2333 82.4130 105.7364 136.2800 170.8557 184.6446 197.5457 228.6460 256.7435 285.2257 301.8732 316.0068 335.5230 359.6665 397.8045 435.1903 465.3297 470.4547 477.6775 540.4990 548.4999 617.8517 683.3936 701.5744 717.8356 741.0048 761.9942 792.3217 795.2942 810.4027 842.0622 877.9809 903.6128 932.1650 959.8100 987.9559 989.9939 1015.0078 1021.1029 1054.0540 1060.6164 1073.9045 1085.4605 1091.1131 1118.5341 1153.6153 1169.9613 1194.8108 1201.3469 1208.4923 1283.1116 1285.6466 1291.5392 1318.9882 1327.4598 1365.4910 1372.6213 1386.1262 1388.9063 1393.6653 1406.2509 1458.1561 1464.1055 1465.5673 1467.9345 1469.5716 1476.3801 1481.1918 1485.0597 1490.6757 1597.0412 1618.6692 1650.1744 1659.5829 2868.6265 2884.3400 2919.2271 2982.7248 2985.4357 3037.2057 3041.2065 3048.2191 3076.7580 3079.4488 3087.8048 3093.3246 3137.3064 3150.5986 3169.6896 3190.2722
redmass: 3.8394 3.6820 3.3002 2.0299 2.9083 6.2411 4.1395 4.3902 2.0594 1.6319 1.5164 3.4311 2.1307 5.1238 3.0162 3.0860 3.8000 3.9429 2.7892 4.2426 6.6598 3.3788 7.4782 4.1304 6.1103 6.2657 5.4613 4.0793 2.7151 1.5167 1.1587 1.2452 4.0386 4.2134 1.4576 2.5508 3.6707 1.4080 2.1500 1.4143 2.1142 4.4636 2.1518 2.7730 1.8680 2.2584 2.0639 1.8666 1.9505 1.3201 2.0782 2.3243 2.9710 1.1632 1.4126 1.2496 3.4750 1.5087 1.3242 1.3375 1.2541 1.2343 2.0189 2.1963 1.9666 2.7042 1.0533 1.2582 1.0817 1.0687 1.0714 1.0635 1.0749 7.5036 8.2836 11.5938 11.4790 1.0727 1.0713 1.0685 1.0356 1.0358 1.0900 1.0894 1.0886 1.0977 1.0976 1.1004 1.1005 1.0868 1.0911 1.0983 1.0953
irintensity: 1.5400 0.3087 1.5800 0.3582 2.0935 0.0233 0.7061 0.1531 1.9049 0.9151 0.6105 2.6990 1.7957 2.1805 2.6459 1.7665 0.3147 1.1175 2.5332 20.1872 6.2398 3.2927 3.1391 6.0941 6.5232 3.7927 7.3954 4.4875 9.0670 78.2280 7.4828 5.9530 7.8664 7.8065 0.7999 7.8017 10.5075 2.4426 11.5841 1.6857 7.1938 18.2740 30.2126 60.9190 16.6331 5.1929 19.8283 3.6911 25.7554 13.3908 18.6516 48.3339 37.4785 7.1982 41.2577 32.1564 46.9206 46.0303 3.4504 6.1220 17.4747 21.4523 34.0661 10.1234 88.8764 8.2721 4.6597 47.1538 8.9647 15.1537 20.2892 13.4801 16.3271 76.1883 413.2941 182.1866 37.7921 70.9053 115.7188 48.9250 22.9120 26.5615 12.6956 9.2405 5.9273 40.1287 77.2759 37.0896 43.1365 3.9182 6.1437 20.7910 2.6484
temp: 298.150 k
press: 1.00000 atm
elementType: 8 8 7 7 6 6 6 6 6 6 6 6 6 6 6 6 6 1 1 1 1 1 1 1 1 1 1 1 1 1 1 1 1
symmnumber: 1
zpe: 702251.1 jmol-1
zpe.correction: 0.267473 hartree
zpe.thermalcorrener: 0.284019 hartree
zpe.thermalcorrenthalpy: 0.284963 hartree
zpe.thermalcorrgfe: 0.222185 hartree
zpe.sumelectzpe: -763.665487 hartree
zpe.sumelectthermal: -763.648941 hartree
zpe.sumelectthermalent: -763.647997 hartree
zpe.sumelectthermalfe: -763.710775 hartree
dipole: 3.9294 5.5975 -0.0620
dipole: 6.8393
quadrupole: -97.1954 -110.4205 -99.7059
quadrupole: -13.2700 -2.8664 -2.1164
quadrupole: 5.2452 -7.9799 2.7347 -13.2700 -2.8664 -2.1164
hfenergy: -763.9329602 hartree
pointgroup: C01 [X(C13H16N2O2)]
dipole: 1.496798 2.2116078 -0.3297418 debye
polarizability: 190.5722055|-2.6908289|192.8478462|-11.9070174|-8.5120538|104.0139964 unknown
InChI: InChI=1S/C13H16N2O2/c1-3-14(4-2)9-15-11-8-6-5-7-10(11)12(16)13(15)17/h5-8H,3-4,9H2,1-2H3
charge 0 multiplicity 1
33 atoms
O  -0.3022 -3.069452 -0.218899
O  -3.140675 -2.116444 0.393425
N  2.335184 -0.081415 0.147092
N  0.05212 -0.72903 -0.450109
C  1.468199 -0.761204 -0.838141
C  -0.747032 0.444208 -0.32481
C  3.650334 0.305152 -0.439097
C  2.454862 -0.84884 1.421635
C  -2.091319 0.094446 0.003295
C  -0.712644 -1.885289 -0.192569
C  -2.16854 -1.373852 0.117518
C  -0.364018 1.786313 -0.484902
C  3.575859 1.544312 -1.352655
C  2.82613 0.042144 2.620273
C  -3.078375 1.085884 0.167284
C  -1.368259 2.775743 -0.323423
C  -2.709207 2.440386 -0.002149
H  1.587355 -0.254151 -1.812795
H  1.713144 -1.840433 -0.971688
H  4.327603 0.532195 0.402481
H  4.11603 -0.547351 -0.99442
H  1.474565 -1.318231 1.619977
H  3.190393 -1.684046 1.318319
H  0.673064 2.056463 -0.693528
H  2.930833 1.381078 -2.235677
H  3.182444 2.409763 -0.790669
H  4.583625 1.801949 -1.727201
H  3.819353 0.51217 2.501522
H  2.079414 0.845843 2.741955
H  2.852374 -0.559144 3.547568
H  -4.10462 0.797946 0.418225
H  -1.094971 3.83038 -0.443238
H  -3.453725 3.233705 0.116998
