program: Gaussian 09
title: 000273041
version: EM64L-G09RevD.01
frameworkgroup: C1[X(C10H17NO4)]
method: RPBEPBE
basis: SDD
operation: Freq
keyword: #p
keyword: freq=noraman
keyword: PBEPBE/SDD
title: #p freq=noraman PBEPBE/SDD
converged: YES YES NO NO
title: Mulliken charges:
elementType: O O O O N C C C C C C C C C C H H H H H H H H H H H H H H H H H
charge: -0.274311 -0.234150 -0.262127 -0.247382 -0.171824 -0.032898 -0.130334 -0.472841 -0.520825 -0.536549 -0.650766 0.254851 0.236457 -0.506186 -0.507189 0.242117 0.231612 0.217288 0.240364 0.252083 0.236383 0.272101 0.261171 0.250425 0.222923 0.198883 0.242389 0.231784 0.242576 0.233917 0.240439 0.239616
chargesum: 0.00000
title: Mulliken charges with hydrogens summed into heavy atoms:
elementType: O O O O N C C C C C C C C C C
charge: -0.274311 -0.234150 -0.262127 -0.247382 -0.171824 0.209219 0.101278 -0.015189 -0.032359 -0.003278 0.021466 0.254851 0.236457 0.210564 0.206783
polarizability: 1.58361229e+02 -3.51575641e-01 1.14462073e+02 -5.89445618e+00 1.08241445e+00 1.05257020e+02
1716.lowfreq: -12.9038 -11.2602 -5.2661 -2.4765 0.0008 0.0009 0.0009 18.3429 35.6188
frequency: -12.1459 17.1768 35.5703 57.2815 82.6864 94.4970 103.6590 115.5231 124.3438 168.5626 177.8571 181.0307 213.5744 236.8458 256.7861 291.2912 317.1330 329.6539 359.5532 384.8850 471.1513 544.8740 572.0871 610.1577 644.6526 674.8072 716.7096 788.9999 821.3279 837.1581 866.4760 880.6986 918.3670 935.5370 958.3427 979.9580 1015.8174 1038.0036 1062.5893 1106.2683 1110.2317 1111.0404 1113.6944 1118.4539 1129.4020 1141.6872 1146.3593 1147.4933 1167.0318 1191.5097 1204.3583 1232.8905 1275.8560 1293.9529 1304.7327 1317.1615 1322.4128 1345.6364 1360.2711 1420.6426 1421.4262 1430.9707 1437.5304 1452.0828 1452.7718 1463.5834 1464.4858 1471.2891 1473.1885 1481.0037 1482.6615 1636.4214 1647.5816 2869.9294 2917.3538 2982.5431 3003.2415 3004.5545 3005.8158 3013.7657 3022.2781 3026.2818 3060.7407 3078.6233 3083.7610 3092.5796 3104.5485 3106.4326 3148.3156 3148.3474
redmass: 5.1488 4.7702 5.1333 3.5045 1.1306 2.8379 1.4956 1.9707 2.8963 3.1490 1.1068 3.6615 2.5010 3.7562 4.0341 3.3049 5.5553 2.8316 4.3089 3.8525 2.8221 2.7620 2.6615 4.2075 4.8342 4.0189 6.9235 4.1501 2.5005 4.1798 3.2347 2.5973 2.8936 2.6210 3.3044 3.1150 2.0462 1.9156 2.0835 1.2961 2.2794 1.2685 1.4474 1.9937 2.5609 2.3368 1.4425 1.4516 1.8679 1.7479 1.8080 1.7442 1.3913 1.6941 1.2953 1.6599 1.4573 1.6017 1.4370 1.1917 1.1833 1.0838 1.1559 1.0508 1.0501 1.0506 1.0507 1.0505 1.0814 1.0960 1.0531 9.0008 9.4483 1.0557 1.0835 1.0836 1.0329 1.0294 1.0588 1.0649 1.0628 1.0744 1.0979 1.1002 1.1006 1.1044 1.1045 1.1045 1.1049 1.1047
irintensity: 1.8076 0.1968 1.2675 0.4566 0.1668 2.0052 1.7791 0.9408 0.9533 7.1049 0.6372 6.0858 5.1384 4.6517 14.1427 10.4378 18.3733 3.8430 1.3990 0.8951 9.8787 2.9191 1.3842 7.5182 9.2821 7.9837 24.5382 7.0471 8.5514 2.6642 7.9994 4.8848 3.9550 7.2883 19.0556 81.6285 21.7693 53.4684 38.0625 7.2975 97.0456 0.1442 20.9831 62.2813 305.0427 50.5289 7.4566 18.2082 28.9612 1.2269 20.7584 6.1342 14.1409 70.3976 4.3490 3.0445 3.5314 3.7538 56.7078 23.9161 15.5378 29.1589 5.0903 13.9201 14.4587 11.9381 9.0737 12.5493 10.0225 10.3009 13.2238 140.7626 161.2157 123.1916 63.7669 17.1806 39.3754 33.0578 5.3557 37.0656 18.0952 33.7895 6.7339 17.4691 20.6762 39.3450 27.9964 26.7417 17.5037 16.1081
temp: 298.150 k
press: 1.00000 atm
elementType: 8 8 8 8 7 6 6 6 6 6 6 6 6 6 6 1 1 1 1 1 1 1 1 1 1 1 1 1 1 1 1 1
symmnumber: 1
zpe: 690429.6 jmol-1
zpe.correction: 0.262971 hartree
zpe.thermalcorrener: 0.279416 hartree
zpe.thermalcorrenthalpy: 0.280360 hartree
zpe.thermalcorrgfe: 0.216998 hartree
zpe.sumelectzpe: -745.703186 hartree
zpe.sumelectthermal: -745.686741 hartree
zpe.sumelectthermalent: -745.685796 hartree
zpe.sumelectthermalfe: -745.749159 hartree
dipole: 0.7773 -0.4501 -0.9426
dipole: 1.3020
quadrupole: -72.7578 -94.8127 -85.8067
quadrupole: -7.6436 -2.4856 -2.0074
quadrupole: 11.7012 -10.3536 -1.3476 -7.6436 -2.4856 -2.0074
hfenergy: -745.9661567 hartree
pointgroup: C01 [X(C10H17N1O4)]
dipole: 0.2950744 0.4186089 -0.010146 debye
polarizability: 158.1575336|6.5950393|108.1278848|0.6818744|-4.4441295|111.7949035 unknown
InChI: InChI=1S/C10H17NO4/c1-11-7(6-9(12)14-2)4-5-8(11)10(13)15-3/h7-8H,4-6H2,1-3H3
charge 0 multiplicity 1
32 atoms
O  3.762122 0.261383 0.100792
O  2.549219 -1.438118 1.133064
O  -3.663397 -0.40423 1.482079
O  -3.612335 0.164101 -0.774867
N  0.698841 0.744208 -0.414802
C  -0.710138 0.372049 -0.750404
C  1.64335 -0.302623 -0.896001
C  -0.582574 -0.882317 -1.658629
C  0.750728 -1.525236 -1.208944
C  -1.513674 0.114377 0.547661
C  1.099219 2.139725 -0.645465
C  2.65966 -0.595811 0.215188
C  -3.00528 -0.028557 0.305538
C  4.786391 0.133076 1.167153
C  -5.136067 -0.550923 1.377148
H  -1.200873 1.197852 -1.303437
H  2.199893 0.036332 -1.7992
H  -0.521238 -0.569704 -2.717315
H  -1.445265 -1.562549 -1.564767
H  0.620974 -2.124163 -0.29011
H  1.1989 -2.174959 -1.978902
H  -1.135832 -0.783109 1.070742
H  -1.353913 0.95329 1.252003
H  2.120807 2.301277 -0.26027
H  0.420723 2.821458 -0.102131
H  1.089242 2.429733 -1.725433
H  4.341658 0.357493 2.1512
H  5.561763 0.866045 0.903757
H  5.194574 -0.891436 1.181432
H  -5.460346 -0.844587 2.385197
H  -5.39173 -1.325703 0.634808
H  -5.5955 0.404727 1.073012
