program: Gaussian 09
title: 000273078
version: EM64L-G09RevD.01
frameworkgroup: C1[X(C21H10Cl2O4S)]
method: RPBEPBE
basis: SDD
operation: Freq
keyword: #p
keyword: freq=noraman
keyword: PBEPBE/SDD
title: #p freq=noraman PBEPBE/SDD
converged: YES YES NO NO
title: Mulliken charges:
elementType: Cl Cl S O O O O C C C C C C C C C C C C C C C C C C C C C H H H H H H H H H H
charge: -0.024531 -0.055002 0.354507 -0.165724 -0.186035 -0.403133 -0.211736 0.317358 0.278870 0.306988 0.271014 -0.527407 -0.196298 -0.232715 0.391308 -0.398408 -0.386653 -0.379210 -0.365953 -0.225151 -0.225560 -0.029652 0.060583 -0.187086 -0.083187 -0.135978 -0.189818 -0.236531 0.302700 0.277118 0.295071 0.292192 0.243677 0.244065 0.294362 0.260716 0.261492 0.393748
chargesum: 0.00000
title: Mulliken charges with hydrogens summed into heavy atoms:
elementType: Cl Cl S O O O O C C C C C C C C C C C C C C C C C C C C C
charge: -0.024531 -0.055002 0.354507 -0.165724 -0.186035 -0.009385 -0.211736 0.317358 0.278870 0.306988 0.271014 -0.527407 -0.196298 -0.232715 0.391308 -0.095708 -0.109535 -0.084140 -0.073761 0.018525 0.018505 -0.029652 0.060583 -0.187086 0.211175 -0.135978 0.070898 0.024961
polarizability: 3.43457153e+02 3.22799249e+00 3.29901781e+02 -2.03563774e+01 1.58018165e+01 2.12975578e+02
1716.lowfreq: -7.3813 -5.1412 -2.0337 -0.0022 -0.0020 -0.0011 10.5176 19.7857 25.8296
frequency: 9.7949 19.7496 25.8114 43.1972 45.2484 66.0234 75.5981 89.8448 114.1161 121.3181 139.6667 159.6150 164.1444 184.4229 214.5140 219.7983 244.2643 258.1381 278.5109 296.7552 309.7764 317.9405 356.4905 376.5369 377.7877 403.1116 407.2560 419.0743 430.9115 440.4409 462.1671 470.8205 487.7316 513.4912 531.7743 546.1303 558.8035 582.7627 614.3878 638.4158 656.6019 662.1172 678.8909 686.7422 701.3140 714.9912 732.3775 738.4095 757.5146 773.8930 804.1764 808.9521 826.7354 864.9152 866.9465 892.3654 933.6387 939.1218 943.7104 955.6174 995.8123 999.1334 1010.1696 1017.0227 1027.2758 1039.2062 1081.4636 1088.8507 1105.3052 1114.6962 1135.3282 1160.8606 1169.9719 1179.1625 1192.0408 1232.9629 1245.3809 1273.3124 1301.3186 1319.5148 1358.4192 1359.9767 1362.1409 1366.9318 1402.4398 1433.3478 1437.2354 1446.1035 1470.6701 1529.9521 1539.6120 1561.0032 1561.5031 1576.5026 1587.8994 1597.2880 1611.8789 1646.7430 3140.1859 3154.4081 3155.6672 3163.8732 3165.0502 3173.4014 3174.6009 3181.6249 3184.3281 3514.2104
redmass: 14.6851 7.9833 8.2992 9.9499 14.0404 8.8884 7.8188 8.2442 9.5916 5.3842 7.5460 7.2460 7.3099 9.4961 10.1908 8.4478 6.7997 9.0148 7.6582 7.7074 24.7865 8.7298 7.3978 10.0520 8.3434 5.6903 6.8447 3.5846 5.7885 3.8401 4.9515 9.6465 5.6115 6.8682 6.4885 3.9300 3.1543 2.0518 4.2749 6.9359 7.1903 6.7413 4.7736 4.2791 6.1726 4.7723 2.7853 6.4990 8.2917 5.6693 1.3352 1.7746 7.3780 1.7432 1.7606 1.6088 7.2632 1.3403 2.2028 8.4208 7.8365 1.3930 1.4070 1.3781 3.0467 2.1567 2.1444 2.6877 3.5870 3.5103 1.3458 1.4851 1.3160 1.7471 1.9458 1.8450 1.3191 2.1959 2.4912 4.1206 3.7487 6.2767 5.1686 11.0031 10.4945 2.4321 2.6745 3.0053 2.6431 9.3365 10.0907 7.1060 6.9945 8.4044 6.9565 8.2527 7.2845 9.6736 1.0865 1.0902 1.0889 1.0889 1.0948 1.0977 1.1001 1.0930 1.0970 1.0641
irintensity: 0.0250 1.0381 0.5723 1.8379 0.3015 0.0550 4.6283 1.0427 0.6403 0.1761 0.2925 0.8874 0.5911 1.1646 0.1741 4.4804 0.5359 0.6319 1.4495 0.8875 0.0199 3.1504 1.7595 11.5690 4.1326 5.4227 5.6139 0.8138 0.9131 18.1898 2.9239 0.9038 8.3307 28.6169 13.1322 12.2093 32.3261 58.0477 37.0615 6.8642 1.8951 4.5450 16.0795 2.5698 8.5732 44.7768 41.0976 5.8813 38.9601 8.4168 38.7785 20.6407 2.8417 17.3432 21.7629 24.8215 28.6006 0.0999 2.2922 21.2636 91.7786 4.1049 1.9953 0.0519 176.5234 84.9644 30.7046 4.4580 21.0556 14.5128 3.5889 23.6700 9.9557 7.1417 8.8930 27.5593 5.1104 226.5807 280.4922 90.7899 14.7435 6.6140 36.7074 1.8978 2.8544 106.0765 13.3586 17.6353 4.8149 69.7685 125.4957 23.0896 20.6110 28.8841 20.6324 6.2207 4.9920 317.8901 3.0883 4.4299 1.5254 0.8204 1.1230 10.6396 20.3983 0.2965 3.1573 46.6966
temp: 298.150 k
press: 1.00000 atm
elementType: 17 17 16 8 8 8 8 6 6 6 6 6 6 6 6 6 6 6 6 6 6 6 6 6 6 6 6 6 1 1 1 1 1 1 1 1 1 1
symmnumber: 1
zpe: 654962.4 jmol-1
zpe.correction: 0.249462 hartree
zpe.thermalcorrener: 0.273354 hartree
zpe.thermalcorrenthalpy: 0.274299 hartree
zpe.thermalcorrgfe: 0.192474 hartree
zpe.sumelectzpe: -2423.420545 hartree
zpe.sumelectthermal: -2423.396653 hartree
zpe.sumelectthermalent: -2423.395709 hartree
zpe.sumelectthermalfe: -2423.477534 hartree
dipole: -1.2484 -2.2219 1.2060
dipole: 2.8195
quadrupole: -162.9088 -167.8435 -192.7650
quadrupole: 11.3408 4.8115 4.6222
quadrupole: 11.5970 6.6623 -18.2593 11.3408 4.8115 4.6222
hfenergy: -2423.6700073 hartree
pointgroup: C01 [X(C21H10Cl2O4S1)]
dipole: -0.6535335 0.8514965 -0.2799248 debye
polarizability: 346.2655428|-0.3374387|320.0568606|5.4928571|36.7660035|220.012109 unknown
InChI: InChI=1S/C21H10Cl2O4S/c22-10-5-8-15(23)16(9-10)28-20-14(21(26)27)7-6-13-17(20)19(25)12-4-2-1-3-11(12)18(13)24/h1-9,26H
charge 0 multiplicity 1
38 atoms
Cl 2.95082 2.232087 2.767851
Cl 2.788041 1.988155 -3.648697
S  2.025937 -0.521385 1.307017
O  -0.217377 1.345031 1.100843
O  -3.889581 -2.11006 -1.100384
O  3.321721 -2.331867 -0.949055
O  2.812107 -4.267338 0.236254
C  -0.627728 -0.861095 0.171767
C  -1.609997 -1.722956 -0.41518
C  -2.507507 0.847792 0.607926
C  -3.470589 -0.016064 0.015513
C  0.718822 -1.33799 0.2842
C  -1.05203 0.496224 0.66196
C  -3.056036 -1.326945 -0.544613
C  1.054682 -2.624962 -0.21737
C  -1.264062 -3.020099 -0.860176
C  0.057242 -3.474732 -0.756984
C  -2.923051 2.095036 1.137241
C  -4.832764 0.37141 -0.04351
C  -4.279591 2.47212 1.083908
C  -5.237656 1.609562 0.490955
C  2.468904 0.955757 0.311881
C  2.459375 -3.161433 -0.22709
C  2.888421 2.142377 0.955115
C  2.45806 0.907946 -1.102108
C  2.821923 2.055954 -1.826668
C  3.266554 3.279961 0.215773
C  3.227111 3.247758 -1.195598
H  -2.055624 -3.645388 -1.283058
H  0.337714 -4.475485 -1.099298
H  -2.164837 2.747164 1.581128
H  -5.546998 -0.314293 -0.509834
H  -4.595449 3.434686 1.499703
H  -6.290445 1.907666 0.448826
H  2.192263 -0.018265 -1.616865
H  3.579151 4.188727 0.737776
H  3.508239 4.127083 -1.780827
H  4.243633 -2.708136 -0.930721
