program: Gaussian 09
title: 000273027
version: EM64L-G09RevD.01
frameworkgroup: C1[X(C13H15N3O4)]
method: RPBEPBE
basis: SDD
operation: Freq
keyword: #p
keyword: freq=noraman
keyword: PBEPBE/SDD
title: #p freq=noraman PBEPBE/SDD
converged: YES YES NO NO
title: Mulliken charges:
elementType: O O O O N N N C C C C C C C C C C C C C H H H H H H H H H H H H H H H
charge: -0.410386 -0.212922 -0.209799 -0.213347 -0.146962 0.010957 0.019484 -0.078430 -0.436688 -0.415635 -0.390335 -0.390546 0.158594 -0.379263 0.466766 -0.519684 -0.373075 0.380831 -0.182518 -0.370860 0.261401 0.217584 0.238573 0.202607 0.232648 0.218742 0.209360 0.226694 0.222938 0.212706 0.379867 0.277237 0.272741 0.235468 0.285251
chargesum: 0.00000
title: Mulliken charges with hydrogens summed into heavy atoms:
elementType: O O O O N N N C C C C C C C C C C C C C
charge: -0.030519 -0.212922 -0.209799 -0.213347 -0.146962 0.010957 0.019484 0.182971 0.019470 0.019620 0.037767 0.059087 0.158594 -0.166557 0.466766 -0.242447 -0.100334 0.380831 0.052950 -0.085609
polarizability: 3.14301316e+02 1.49514857e+01 1.90604305e+02 1.28643185e+00 6.58912015e-01 9.94736382e+01
1716.lowfreq: -11.2520 -4.0410 0.0008 0.0009 0.0010 1.8025 18.1531 30.5913 40.7548
frequency: 18.0999 30.5016 40.6818 52.7560 57.4799 83.9194 110.5315 122.5792 169.4295 184.6010 195.5632 212.5310 257.5413 290.7741 298.9185 320.7194 334.8726 358.7384 386.8544 425.1307 444.3138 466.5234 492.2277 530.5885 535.8190 548.9207 596.1556 613.9807 647.1109 673.1403 685.2643 696.1868 704.3394 760.7762 800.9971 815.9503 820.4257 847.6612 871.2610 876.1443 908.8668 924.2559 935.9341 949.0382 957.2530 985.3231 994.5337 1003.9518 1044.6585 1063.0810 1082.0883 1088.3381 1091.4450 1108.8432 1127.7101 1141.6020 1170.8490 1189.9454 1214.1237 1229.2825 1239.8238 1253.4744 1262.4839 1277.1708 1299.4537 1310.1479 1337.5283 1339.3989 1350.6667 1359.0573 1366.6146 1368.9728 1372.2943 1407.5685 1436.6680 1458.2706 1466.3966 1467.8443 1474.6195 1479.4722 1559.8328 1583.2112 1615.2765 1676.1007 2910.3643 2960.0598 2978.9110 2995.7019 3002.5977 3032.7437 3047.0709 3048.8926 3059.4981 3070.2446 3146.8611 3161.9442 3171.6317 3188.2943 3508.8635
redmass: 6.5497 4.3329 7.0671 9.6183 6.2137 4.0288 8.0563 4.3643 4.2689 4.6944 2.9840 5.4009 3.6165 3.4732 3.4569 3.7247 3.5815 3.6301 7.7951 3.3075 3.5098 4.5754 3.5461 4.0001 5.0820 3.3430 1.5438 3.6962 5.5763 4.1937 2.1877 4.0839 5.7028 4.6351 4.6247 1.8454 1.4757 1.9113 1.5172 2.7755 3.7690 1.6206 1.6123 1.3873 2.5061 6.1849 3.1187 1.3664 1.8852 2.3509 1.6996 1.7059 1.5150 2.2092 2.5860 2.4347 1.1384 1.8837 4.9801 1.3955 2.3537 1.9905 1.3172 1.2894 1.4167 1.3466 1.4427 1.3624 1.4565 2.1956 1.6572 2.1484 3.7006 3.2860 3.5250 1.0865 1.0882 1.0846 1.1142 2.7921 6.1971 5.9815 7.0429 8.8496 1.0691 1.0837 1.0643 1.0619 1.0606 1.0902 1.0866 1.0963 1.1037 1.1038 1.0880 1.0915 1.0940 1.0963 1.0639
irintensity: 1.6877 0.5639 0.3117 4.1879 0.9560 1.8071 0.9646 1.6010 3.8455 3.7856 4.0023 2.4714 2.4572 3.9234 0.1580 3.9002 1.8704 19.1455 0.6040 0.5120 0.2514 6.3044 21.4709 6.2381 5.0488 1.0805 94.6276 20.4193 5.9688 3.3911 26.6069 180.5846 16.9228 4.2639 8.2612 6.7377 28.2571 25.8932 15.0555 8.0123 2.1140 4.7681 32.7711 10.1300 0.6982 2.9573 133.8320 1.7088 117.0386 70.7268 7.4236 15.0844 26.1083 93.9730 20.5552 86.2242 12.5509 38.4404 322.1998 0.4259 59.2619 9.6762 19.8075 4.1146 1.9989 24.0978 47.7905 8.0406 15.7810 0.8667 46.1827 83.5759 63.7829 6.9570 8.8022 9.8584 48.7950 17.4296 5.1340 22.6462 166.1674 48.6446 12.3207 190.8127 46.7353 44.2581 40.2353 25.9295 18.1321 16.0327 38.8737 64.0511 28.4212 45.7073 10.5921 3.3570 5.8396 5.0243 24.6324
temp: 298.150 k
press: 1.00000 atm
elementType: 8 8 8 8 7 7 7 6 6 6 6 6 6 6 6 6 6 6 6 6 1 1 1 1 1 1 1 1 1 1 1 1 1 1 1
symmnumber: 1
zpe: 709607.8 jmol-1
zpe.correction: 0.270275 hartree
zpe.thermalcorrener: 0.288504 hartree
zpe.thermalcorrenthalpy: 0.289448 hartree
zpe.thermalcorrgfe: 0.221298 hartree
zpe.sumelectzpe: -967.949314 hartree
zpe.sumelectthermal: -967.931086 hartree
zpe.sumelectthermalent: -967.930141 hartree
zpe.sumelectthermalfe: -967.998291 hartree
dipole: -7.6406 0.1411 -1.5820
dipole: 7.8039
quadrupole: -139.6218 -103.0258 -122.8526
quadrupole: 20.1375 5.7453 -3.3276
quadrupole: -17.7884 18.8076 -1.0192 20.1375 5.7453 -3.3276
hfenergy: -968.2195892 hartree
pointgroup: C01 [X(C13H15N3O4)]
dipole: 3.0299803 0.1355419 0.4769785 debye
polarizability: 314.6497039|-11.50312|189.8750843|-9.1849689|0.4030012|99.8544707 unknown
InChI: InChI=1S/C13H15N3O4/c17-13(18)12-6-1-2-7-15(12)14-9-10-4-3-5-11(8-10)16(19)20/h3-5,8-9,12,17H,1-2,6-7H2
charge 0 multiplicity 1
35 atoms
O  2.950957 2.680128 1.002485
O  2.980294 2.162527 -1.26275
O  -6.145545 -0.377086 0.493135
O  -4.870373 -2.265495 0.444207
N  2.312285 -0.547269 -0.012601
N  1.068045 0.018051 0.110586
N  -5.004766 -0.979986 0.432477
C  3.386578 0.380416 0.422385
C  4.764654 -0.051891 -0.133506
C  5.049575 -1.531092 0.19867
C  3.936453 -2.416141 -0.397959
C  2.543252 -2.005355 0.122718
C  3.056376 1.792046 -0.075411
C  -0.042719 -0.69838 0.137249
C  -1.344188 -0.019021 0.198306
C  -2.527936 -0.796832 0.281442
C  -1.462116 1.403791 0.176834
C  -3.77825 -0.149221 0.345029
C  -2.72429 2.025305 0.241981
C  -3.906772 1.256286 0.327938
H  3.426616 0.414547 1.531775
H  5.540981 0.607196 0.296776
H  4.763959 0.097615 -1.229392
H  5.099626 -1.671686 1.297762
H  6.033506 -1.826125 -0.209378
H  3.950152 -2.326114 -1.5008
H  4.100679 -3.48147 -0.15079
H  1.770972 -2.532615 -0.466148
H  2.418547 -2.311563 1.187834
H  -0.066428 -1.800115 0.115451
H  2.790635 3.599807 0.654845
H  -2.494399 -1.890689 0.297548
H  -0.545154 1.996189 0.103678
H  -2.793631 3.117909 0.222307
H  -4.89888 1.711427 0.377817
