program: Gaussian 09
title: 000273147
version: EM64L-G09RevD.01
frameworkgroup: C1[X(C21H25NO7S)]
method: RPBEPBE
basis: SDD
operation: Freq
keyword: #p
keyword: freq=noraman
keyword: PBEPBE/SDD
title: #p freq=noraman PBEPBE/SDD
converged: YES YES NO NO
title: Mulliken charges:
elementType: S O O O O O O O N C C C C C C C C C C C C C C C C C C C C C H H H H H H H H H H H H H H H H H H H H H H H H H
charge: 0.171343 -0.265465 -0.269420 -0.272568 -0.263683 -0.283131 -0.185081 -0.217179 0.019970 -0.290037 -0.392354 -0.580355 0.514265 -0.660663 -0.279000 0.556591 -0.516757 -0.434242 0.064715 -0.607357 0.307884 -0.193643 0.105225 0.268499 -0.371884 0.054968 -0.538209 -0.518262 -0.533688 -0.517028 0.233053 0.278616 0.252554 0.239140 0.258513 0.271838 0.238184 0.255002 0.245199 0.280832 0.263404 0.227153 0.251291 0.245200 0.229925 0.210462 0.252971 0.231070 0.240782 0.249873 0.235379 0.224798 0.224174 0.253192 0.233942
chargesum: 0.00000
title: Mulliken charges with hydrogens summed into heavy atoms:
elementType: S O O O O O O O N C C C C C C C C C C C C C C C C C C C C C
charge: 0.171343 -0.265465 -0.269420 -0.272568 -0.263683 -0.283131 -0.185081 -0.217179 0.019970 -0.290037 0.119316 -0.088661 0.514265 -0.130312 0.214186 0.556591 -0.271558 -0.153410 0.064715 -0.343953 0.307884 0.033510 0.105225 0.268499 -0.120592 0.054968 0.147378 0.206561 0.176361 0.194280
polarizability: 3.15160484e+02 9.56731385e+00 3.45894120e+02 -1.18690634e+01 9.21606329e+00 2.19590856e+02
1716.lowfreq: -6.3954 -0.0014 -0.0008 -0.0004 4.2499 5.6086 15.7767 20.3807 28.3686
frequency: 15.6238 20.1813 28.2332 34.4868 51.7133 62.3678 66.8227 77.1484 83.1987 94.0019 96.6724 100.8054 107.1996 119.6108 130.1442 149.0246 157.8395 160.0692 166.0007 173.3749 192.0210 203.2063 214.0665 218.3902 235.5090 251.1912 266.9794 273.2961 280.7960 293.4892 298.0077 307.5975 317.7505 329.5475 332.4326 374.2481 385.0051 419.2631 435.6682 446.0644 468.1356 478.2246 487.1624 528.3768 532.3654 548.4822 564.1251 587.0042 609.7976 625.5928 637.2412 657.0109 676.5231 690.6354 701.0735 723.8586 732.3438 764.1935 782.3062 788.6761 809.7582 816.6790 826.8025 854.0392 861.4406 864.3401 874.9917 914.5156 920.7792 935.2140 942.9926 981.5295 982.8405 983.6297 999.8972 1006.9343 1013.0006 1022.6703 1040.8900 1064.7734 1072.9121 1087.8092 1095.9173 1108.1337 1110.9479 1112.4827 1112.9200 1147.1363 1149.2392 1155.0966 1156.7907 1157.8565 1162.3629 1169.5529 1174.1561 1195.1989 1208.2201 1226.3526 1237.8454 1258.6928 1265.3350 1273.0430 1298.0128 1305.1973 1311.2938 1329.8322 1345.1752 1349.9662 1373.3303 1390.8191 1392.7740 1417.7468 1421.1683 1433.7711 1443.8788 1445.4008 1450.3028 1457.3420 1462.4343 1464.7397 1465.8585 1467.0878 1468.9062 1469.6573 1472.7234 1478.1794 1478.7395 1484.3022 1485.7169 1490.4648 1564.3748 1587.8095 1598.3842 1608.0869 2955.2563 2972.7454 2985.0307 2991.4481 3007.3428 3017.2946 3020.6935 3041.0403 3042.1384 3066.5421 3069.0546 3090.8298 3093.8963 3098.5129 3099.3610 3121.7776 3122.7309 3130.4093 3133.7853 3133.9872 3137.1414 3145.9317 3157.5896 3168.3614 3185.4184
redmass: 5.5264 4.8357 4.7465 5.7761 5.7672 4.1418 3.5754 4.0336 4.6439 3.8014 4.2428 3.2908 3.6646 3.4967 4.0594 1.5320 1.4116 2.6817 2.2781 3.6850 3.2381 2.1163 2.6649 2.7659 2.4999 4.2183 1.8038 2.5325 4.3001 3.0533 3.7101 5.1160 4.4567 4.4096 5.7313 5.3862 5.0864 5.2926 4.5735 3.4551 6.5636 5.3929 6.0533 4.3156 5.5653 4.8264 6.8420 4.7577 5.7585 7.2083 4.9935 3.5818 4.9383 4.0788 2.6917 5.5108 7.8579 2.9843 5.7366 1.7692 1.7210 2.9675 5.0223 1.6599 1.9503 1.7644 6.7560 1.4212 2.4649 6.0522 2.8322 5.3333 5.1174 1.5594 5.6294 3.1441 4.1374 1.7230 3.5090 2.9067 3.3249 2.4930 2.2908 1.2668 1.2663 1.2571 1.2615 1.4271 1.5068 1.3733 1.3969 1.4355 1.5006 1.1797 3.3039 1.2840 2.0344 2.8280 2.9022 1.9617 1.2402 1.2407 1.4427 1.5022 4.7791 1.4751 1.3440 3.9288 6.6286 9.1817 3.1308 2.0512 1.3095 1.3725 1.2642 1.4253 1.0914 1.1973 1.1031 1.2931 1.0589 1.1780 1.2450 1.0627 1.0581 1.1869 1.2398 1.7957 1.1277 1.0905 8.6438 6.7311 7.1431 6.0007 1.0336 1.0323 1.0312 1.0289 1.0606 1.0617 1.0631 1.0570 1.1032 1.1044 1.0978 1.1024 1.1038 1.1008 1.1056 1.1101 1.0992 1.1039 1.1007 1.1038 1.0879 1.0900 1.0903 1.0945 1.0952
irintensity: 0.9574 0.1744 1.2592 0.5706 0.4361 1.5448 3.1173 2.8354 3.4232 5.1037 2.3893 6.7200 7.1422 9.4010 0.8834 1.0862 0.5137 1.2551 2.3912 4.7486 0.8071 2.6251 1.1837 1.3278 2.3279 1.7603 2.2103 3.4284 6.5424 9.2858 4.2500 5.3600 3.4502 4.7420 1.1329 5.6180 1.2084 4.9791 1.4382 0.8412 1.9859 17.2803 7.3441 4.6799 12.0523 8.8982 8.4783 11.6537 6.8821 8.4672 2.2726 3.9835 1.6270 3.2993 17.7544 9.4377 11.5259 38.2645 25.3582 45.0823 29.3352 8.5007 34.2302 16.7077 12.8935 16.3421 11.8472 1.6454 19.1807 15.6406 13.0948 3.4337 68.5340 7.6718 52.4221 24.0250 10.8143 5.5848 60.3448 9.9777 105.2703 101.0921 12.0582 1.8714 12.6113 0.3067 0.2308 13.1107 6.1576 3.2579 13.7082 12.0288 45.6768 1.7054 37.1872 11.2462 55.7784 310.0754 127.5218 78.5888 37.0940 3.6484 41.3320 47.6593 72.5543 14.5718 18.6656 64.3492 33.3276 5.1731 134.6890 37.0180 14.7653 21.7832 15.3620 7.2629 4.8735 49.0337 4.7931 63.0162 28.5602 30.1981 77.6270 22.3215 15.6756 57.0374 16.3688 7.5227 7.0450 13.7033 117.6817 90.0059 18.3993 102.5822 51.0062 50.7274 72.3483 59.6860 10.1642 27.3470 8.3233 36.6922 49.3680 34.1201 3.7262 28.8269 19.0652 4.1303 15.0866 18.1540 27.6984 18.0206 22.1822 17.7564 15.5773 5.6153 4.9708 9.6703 4.5128
temp: 298.150 k
press: 1.00000 atm
elementType: 16 8 8 8 8 8 8 8 7 6 6 6 6 6 6 6 6 6 6 6 6 6 6 6 6 6 6 6 6 6 1 1 1 1 1 1 1 1 1 1 1 1 1 1 1 1 1 1 1 1 1 1 1 1 1
symmnumber: 1
zpe: 1125145.8 jmol-1
zpe.correction: 0.428545 hartree
zpe.thermalcorrener: 0.459509 hartree
zpe.thermalcorrenthalpy: 0.460454 hartree
zpe.thermalcorrgfe: 0.364467 hartree
zpe.sumelectzpe: -1792.201342 hartree
zpe.sumelectthermal: -1792.170378 hartree
zpe.sumelectthermalent: -1792.169434 hartree
zpe.sumelectthermalfe: -1792.265421 hartree
dipole: -1.1198 5.2246 1.5426
dipole: 5.5615
quadrupole: -187.1455 -167.3115 -178.7679
quadrupole: -14.9839 -3.2894 4.9557
quadrupole: -9.4039 10.4301 -1.0263 -14.9839 -3.2894 4.9557
hfenergy: -1792.6298874 hartree
pointgroup: C01 [X(C21H25N1O7S1)]
dipole: 0.4704887 2.0540085 -0.5892563 debye
polarizability: 315.8875725|-9.1048929|345.9499527|-8.1110577|-9.567858|218.8079352 unknown
InChI: InChI=1S/C21H25NO7S/c1-25-16-7-5-6-15(13-16)21(29-10-11-30-21)9-8-14-12-17(26-2)19(27-3)20(28-4)18(14)22(23)24/h5-7,12-13H,8-11H2,1-4H3
charge 0 multiplicity 1
55 atoms
S  -3.21805 -1.824886 -2.166045
O  -2.540514 -2.476435 0.407121
O  -4.596218 3.279613 -0.514318
O  4.62185 -1.46732 -0.220304
O  3.069332 3.106553 0.058304
O  5.171043 1.275935 -0.223429
O  2.924105 -3.068595 1.334241
O  1.169185 -3.071478 -0.116597
N  2.124529 -2.468402 0.519426
C  -2.471396 -1.279032 -0.412644
C  -1.005731 -0.839888 -0.658345
C  -0.24313 -0.597897 0.675734
C  -3.331627 -0.19506 0.221123
C  -3.148656 -3.642149 -1.636214
C  -2.230699 -3.6728 -0.396527
C  1.185522 -0.141951 0.432813
C  -3.540249 1.020932 -0.481825
C  -3.889126 -0.368148 1.507607
C  2.295526 -1.01898 0.321499
C  1.447844 1.2458 0.342539
C  -4.313461 2.048544 0.104382
C  -4.65179 0.675241 2.08745
C  3.616277 -0.545046 0.065079
C  2.751348 1.747625 0.12786
C  -4.868126 1.882609 1.399145
C  3.850094 0.848603 -0.036716
C  -4.12066 3.471575 -1.885284
C  5.736248 -1.561767 0.754908
C  1.989358 4.076269 0.285535
C  5.4446 2.081431 -1.436976
H  -1.01199 0.083507 -1.267119
H  -0.478529 -1.610216 -1.243148
H  -0.28155 -1.532413 1.261449
H  -0.772336 0.177015 1.26042
H  -2.73179 -4.237688 -2.464218
H  -4.170775 -3.973379 -1.397613
H  -2.445143 -4.530699 0.260845
H  -1.16217 -3.683063 -0.679566
H  -3.130298 1.137249 -1.490643
H  -3.729457 -1.311501 2.034317
H  0.606154 1.932791 0.471563
H  -5.083614 0.540642 3.08543
H  -5.462454 2.69539 1.827302
H  -4.476834 4.47061 -2.176825
H  -4.543012 2.709719 -2.568977
H  -3.014028 3.44105 -1.939515
H  6.212085 -0.575789 0.889008
H  6.443311 -2.275951 0.308011
H  5.34788 -1.959047 1.709376
H  2.473626 5.060944 0.218814
H  1.544359 3.943963 1.289285
H  1.203852 3.990262 -0.488986
H  5.177015 1.50715 -2.343333
H  4.889787 3.033622 -1.402734
H  6.528887 2.266438 -1.415285
