program: Gaussian 09
title: 000273010
version: EM64L-G09RevD.01
frameworkgroup: C1[X(C7H6N6)]
method: RPBEPBE
basis: SDD
operation: Freq
keyword: #p
keyword: freq=noraman
keyword: PBEPBE/SDD
title: #p freq=noraman PBEPBE/SDD
converged: NO YES NO YES
title: Mulliken charges:
elementType: N N N N N N C C C C C C C H H H H H H
charge: -0.164071 -0.025179 -0.046460 -0.072278 -0.615843 -0.034734 -0.068562 0.168517 0.074118 0.190700 -0.604890 -0.352083 -0.173825 0.253948 0.253951 0.267982 0.251702 0.353000 0.344008
chargesum: 0.00000
title: Mulliken charges with hydrogens summed into heavy atoms:
elementType: N N N N N N C C C C C C C
charge: -0.164071 -0.025179 -0.046460 -0.072278 0.081165 -0.034734 -0.068562 0.168517 0.074118 0.190700 0.170991 -0.100381 -0.173825
polarizability: 1.61668117e+02 2.75770102e+00 1.36453928e+02 2.06079542e-02 2.44475465e-03 5.10773214e+01
1716.lowfreq: -0.0009 -0.0009 -0.0008 4.4332 4.9072 8.5082 86.5107 100.3122 110.6387
frequency: 86.5102 100.2990 110.6346 132.1929 193.0245 226.1762 250.2070 313.7367 317.9428 440.2674 485.5005 496.6412 523.9067 524.6246 545.9615 568.9920 579.1741 637.6496 671.2648 679.6063 695.1172 790.9087 805.8853 935.9636 940.9100 961.3708 1018.5229 1120.3842 1129.3896 1190.8702 1246.8876 1258.3238 1309.2736 1339.7543 1359.4177 1400.2518 1420.3104 1443.4593 1458.2181 1468.7537 1487.4852 1546.1300 1581.6642 1635.3618 2179.6744 3011.2733 3108.3928 3131.0702 3170.5976 3526.2469 3676.6278
redmass: 2.4411 1.4486 9.4243 3.4139 8.8998 3.2429 5.4903 6.9053 3.6230 7.5233 6.7809 5.1764 1.1907 7.8573 3.9818 5.5122 1.2492 6.8279 9.9234 8.0848 8.2366 8.0087 11.9070 6.8559 1.4389 2.5573 2.8091 3.3750 1.3145 3.3827 4.8619 4.4645 5.3934 7.5007 2.3214 3.2029 1.9493 2.9150 1.9821 1.0420 1.2830 6.6056 2.9548 1.7730 12.6055 1.0327 1.1029 1.1024 1.0926 1.0454 1.1053
irintensity: 6.1002 1.2900 6.0775 1.9040 0.0307 8.7699 1.0643 5.4996 0.4720 2.9323 0.6681 1.8572 89.5335 3.8382 22.4356 5.3553 166.5766 2.8045 8.1769 11.9129 12.9491 16.1452 10.2173 7.8725 10.6652 5.4347 3.6112 36.8458 0.9346 18.5635 36.6607 16.3141 105.4215 16.2843 13.2248 3.9157 19.5030 19.2647 12.9874 18.4924 9.6347 131.4524 102.4023 432.0504 51.1232 32.3662 12.7474 1.4758 15.1587 104.5948 54.4284
temp: 298.150 k
press: 1.00000 atm
elementType: 7 7 7 7 7 7 6 6 6 6 6 6 6 1 1 1 1 1 1
symmnumber: 1
zpe: 354290.9 jmol-1
zpe.correction: 0.134942 hartree
zpe.thermalcorrener: 0.145724 hartree
zpe.thermalcorrenthalpy: 0.146668 hartree
zpe.thermalcorrgfe: 0.098314 hartree
zpe.sumelectzpe: -597.931294 hartree
zpe.sumelectthermal: -597.920513 hartree
zpe.sumelectthermalent: -597.919568 hartree
zpe.sumelectthermalfe: -597.967923 hartree
dipole: 1.7237 1.2382 0.0012
dipole: 2.1223
quadrupole: -74.9475 -77.9548 -75.3249
quadrupole: -17.6083 -0.0047 -0.0032
quadrupole: 1.1283 -1.8791 0.7508 -17.6083 -0.0047 -0.0032
hfenergy: -598.0662367 hartree
pointgroup: C01 [X(C7H6N6)]
dipole: -0.8345777 0.0260138 0.0004888 debye
dipolederiv: -0.6286419 0.3649125 0.0001 -0.2315351 -0.3010077 -0.0000342 -0.0000143 0.0000358 -0.1113453 0.2204774 -0.5573625 -0.000064 -0.3634326 -0.2367779 0.0000621 -0.0001378 0.0000304 -0.1585637 -0.7117473 -0.223337 0.0000218 -0.1835276 -0.8402584 -0.0000415 0.000012 -0.000026 -0.1949771 -0.869185 0.6033592 0.0000488 -0.0262067 -0.6446372 0.0000011 0.0000117 -0.000067 -0.2422518 -0.5532919 0.7146933 0.0000427 0.4400026 -1.048635 -0.0000139 0.0000164 -0.0000448 -0.6596512 -0.4732395 0.0321783 -0.0003265 0.1548396 -0.2577614 0.0001134 0.0000445 0.0000189 -0.2376864 -0.1817627 -0.0047725 0.0000106 0.2123657 -0.6838205 -0.0000412 -0.000046 -0.0000006 0.0022377 0.5105269 0.2466906 -0.0000132 0.4322671 0.491205 -0.0000072 0.0000036 0.0000109 0.1093537 0.0316893 0.2925396 0.0000385 0.4105881 0.0237238 -0.0001108 0.0000161 -0.0000407 0.1225641 0.9127595 -0.7891487 -0.0000699 -0.3549884 1.3497343 0.0000435 -0.0000326 0.0000772 0.2419758 0.1075639 -0.2098136 -0.000029 -0.1107051 0.4922378 0.000072 0.0000111 0.0000197 0.1850866 0.6379539 -0.1922911 -0.0000201 0.0202189 0.9696199 0.0000547 0.0000415 0.0001081 -0.0421625 0.5094217 -0.1594037 0.0002374 -0.3214814 0.0191753 -0.0000401 0.0000827 -0.0000334 0.0397743 0.0959665 -0.0186911 -0.0706891 0.029295 -0.0262864 -0.0531279 -0.0311663 -0.1117015 -0.0280243 0.0959581 -0.0187841 0.0707302 0.0292514 -0.0262784 0.0531278 0.0312108 0.1116714 -0.0279151 -0.0103618 0.0322032 -0.000031 -0.0507942 0.116846 -0.0000266 -0.0000245 -0.0000206 0.1355853 -0.0702623 -0.0322539 0.0000031 -0.0399609 0.0835999 -0.0000006 -0.000048 -0.0000198 0.1227252 0.2085105 -0.0759134 0.0000043 -0.0231209 0.2182199 -0.0000257 0.0000152 -0.0000211 0.3688415 0.1676648 -0.0048052 0.0000053 -0.0230754 0.3011009 -0.0000048 0.000004 0.0000034 0.3744333 unknown
polarizability: 154.9964769|-11.4592374|143.1255671|-0.0178417|0.010599|51.0773214 unknown
InChI: InChI=1S/C7H6N6/c1-13-7-5(4(2-8)12-13)6(9)10-3-11-7/h3H,9H2,1H3
charge 0 multiplicity 1
19 atoms
N  -0.296102 1.893337 0.000014
N  1.08486 1.765798 -0.000035
N  -2.283953 0.429923 0.000014
N  -1.701324 -1.957984 -0.000152
N  0.502721 -2.761435 -0.000279
N  3.716958 -0.654105 -0.001237
C  0.089255 -0.330356 -0.000099
C  -0.938201 0.659493 -0.000012
C  1.322185 0.410096 -0.000065
C  -0.353277 -1.694581 -0.000185
C  -0.925158 3.215075 0.000118
C  -2.575177 -0.902509 -0.00001
C  2.641855 -0.126785 -0.000107
H  -0.625516 3.778347 0.898767
H  -0.625185 3.778625 -0.898242
H  -2.015321 3.061583 -0.000094
H  -3.636423 -1.167565 -0.000111
H  1.514422 -2.643086 -0.000261
H  0.09908 -3.697374 -0.000326
