program: Gaussian 09
title: 000273009
version: EM64L-G09RevD.01
frameworkgroup: C1[X(C18H13N3)]
method: RPBEPBE
basis: SDD
operation: Freq
keyword: #pfreq=noraman
keyword: PBEPBE/SDD
title: #p freq=noraman PBEPBE/SDD
converged: YES YES NO NO
title: Mulliken charges:
elementType: N N N C C C C C C C C C C C C C C C C C C H H H H H H H H H H H H H
charge: -0.014988 -0.024199 -0.021707 -0.103663 -0.619246 -0.626376 0.405539 0.405478 0.225397 0.261893 -0.376366 -0.410773 -0.185675 -0.363967 -0.356117 -0.227859 -0.227390 -0.222680 -0.219263 -0.288624 -0.294272 0.309820 0.236976 0.263271 0.263925 0.238864 0.251226 0.244106 0.258451 0.259904 0.239285 0.236198 0.241475 0.241356
chargesum: 0.00000
title: Mulliken charges with hydrogens summed into heavy atoms:
elementType: N N N C C C C C C C C C C C C C C C C C C
charge: -0.014988 -0.024199 -0.021707 0.206157 -0.118999 -0.123588 0.405539 0.405478 0.225397 0.261893 -0.125140 -0.166667 -0.185675 -0.105515 -0.096213 0.011426 0.008807 0.018795 0.022093 -0.288624 -0.294272
polarizability: 2.33874598e+02 -4.09000362e+01 1.84511289e+02 -1.16786386e+01 -9.21733106e+00 1.73541477e+02
1716.lowfreq: -5.0934 -0.0006 -0.0006 -0.0002 4.4079 9.4146 21.6802 25.4218 36.8517
frequency: 21.4274 25.3737 36.8404 50.7015 71.9092 77.0866 115.0514 121.7968 141.9598 149.0331 161.1976 194.4746 241.7558 260.9724 322.0877 339.2783 344.2008 382.0409 382.8671 435.1376 456.3372 488.0288 493.0230 520.2716 549.2326 559.9496 566.9850 572.1323 577.8400 609.7726 612.6323 714.5821 721.1903 734.0657 758.0433 775.2435 776.5296 808.6262 830.2179 844.8052 883.2796 891.8371 897.6560 965.6299 967.8467 983.5343 1001.1829 1001.4754 1020.9292 1038.3901 1046.5344 1047.6140 1089.8256 1102.3814 1161.4010 1179.8992 1181.5122 1187.1382 1187.8335 1203.2896 1223.6129 1224.4712 1276.8506 1283.4315 1294.5685 1306.4474 1314.8602 1337.2330 1375.9060 1376.9996 1437.0690 1438.1698 1471.9062 1475.8862 1477.7769 1479.5483 1576.7353 1577.8427 1608.2245 1608.5533 2170.4944 2172.8483 2190.6224 2998.1930 3002.2743 3008.9378 3064.0433 3067.6440 3128.8488 3136.4676 3146.5283 3147.1975 3159.1466 3160.0025 3174.8399 3176.8048
redmass: 7.6013 8.1717 6.1630 6.6406 6.3717 7.0244 6.1972 5.0687 7.4050 5.8172 6.3248 5.6338 6.4480 5.0961 5.6943 2.5247 2.6151 4.1624 4.0899 5.3853 5.6964 5.9813 5.0872 3.7018 5.2978 5.1924 5.7019 4.3137 4.6292 6.2644 5.1464 4.5405 4.7097 3.4689 3.5487 1.4644 1.3576 3.0059 4.1238 3.6214 1.7153 1.4860 1.5678 1.4016 1.4091 2.3519 1.3491 1.3498 3.1344 2.9848 2.5369 2.4498 2.2970 2.3784 1.1673 1.0734 1.0720 2.1594 2.4519 1.2988 2.4448 2.4653 1.2554 1.3136 1.3784 1.3426 1.4053 1.4789 6.1616 5.7298 2.2541 2.2830 1.1661 1.3659 2.5839 1.6457 6.4489 6.5357 6.2849 6.2253 12.6358 12.6344 12.5472 1.0702 1.0599 1.0721 1.1032 1.1028 1.0878 1.0868 1.0897 1.0898 1.0951 1.0944 1.1010 1.1005
irintensity: 1.1817 2.3666 3.6151 0.9139 1.5455 1.5874 0.3375 3.6544 7.5022 1.7293 4.3355 0.0272 0.5747 1.7846 0.3665 0.5335 0.4679 0.1461 0.1228 0.5560 5.0444 1.0370 4.7853 12.2204 3.8281 8.4062 4.3699 0.9036 0.5310 1.4016 3.1993 2.1704 2.7102 4.9454 3.7554 44.9282 103.9806 1.9206 0.9141 0.8917 3.2331 0.2151 0.5338 1.5915 3.4694 0.0989 0.0413 0.0749 0.6307 0.6798 5.8658 5.5357 4.0055 9.0671 0.2884 0.6244 0.3685 2.9423 0.0820 7.4512 4.6977 4.2226 0.0991 5.9713 0.2815 5.0893 2.9610 0.9273 1.7377 2.1573 3.3601 11.3868 14.5479 17.0595 17.8990 5.0716 0.5842 0.9084 9.5647 5.9318 31.7340 24.5899 9.3477 7.0279 7.7086 10.1871 3.5046 12.8601 5.1716 1.9499 6.3849 4.9817 11.7695 13.6321 16.7288 13.7576
temp: 298.150 k
press: 1.00000 atm
elementType: 7 7 7 6 6 6 6 6 6 6 6 6 6 6 6 6 6 6 6 6 6 1 1 1 1 1 1 1 1 1 1 1 1 1
symmnumber: 1
zpe: 675620.2 jmol-1
zpe.correction: 0.257330 hartree
zpe.thermalcorrener: 0.275879 hartree
zpe.thermalcorrenthalpy: 0.276823 hartree
zpe.thermalcorrgfe: 0.208185 hartree
zpe.sumelectzpe: -856.505361 hartree
zpe.sumelectthermal: -856.486812 hartree
zpe.sumelectthermalent: -856.485868 hartree
zpe.sumelectthermalfe: -856.554506 hartree
dipole: -0.1970 -2.3230 -5.5400
dipole: 6.0105
quadrupole: -98.5186 -135.7581 -127.7792
quadrupole: 6.2546 -7.4623 -8.5695
quadrupole: 22.1667 -15.0728 -7.0939 6.2546 -7.4623 -8.5695
hfenergy: -856.7626914 hartree
pointgroup: C01 [X(C18H13N3)]
dipole: 0.390415 1.6219778 -1.6759142 debye
polarizability: 223.4186568|-48.4779461|187.461736|0.3380358|7.4316086|181.0469715 unknown
InChI: InChI=1S/C18H13N3/c19-11-14(9-15-5-1-3-7-17(15)12-20)10-16-6-2-4-8-18(16)13-21/h1-8,14H,9-10H2
charge 0 multiplicity 1
34 atoms
N  1.413703 -3.630544 -0.729973
N  0.041229 2.181358 1.569482
N  -2.290544 -1.529847 2.479314
C  0.098048 -1.324657 -0.443155
C  0.919821 -0.15744 -1.092829
C  -1.339518 -1.460469 -1.062337
C  2.223096 0.125342 -0.365023
C  -2.196455 -0.223446 -0.843686
C  2.258273 0.997188 0.769653
C  -2.723285 0.094902 0.448031
C  3.431548 -0.489256 -0.768996
C  -2.484703 0.658544 -1.91176
C  0.822504 -2.604142 -0.585148
C  3.474881 1.234759 1.466715
C  -3.491614 1.27231 0.649975
C  4.640265 -0.254894 -0.076861
C  -3.260615 1.823444 -1.715763
C  4.663365 0.608858 1.042748
C  -3.760173 2.134685 -0.430612
C  1.052565 1.648915 1.215234
C  -2.484458 -0.78516 1.563164
H  -0.007631 -1.122319 0.640863
H  1.121138 -0.413926 -2.149063
H  0.271851 0.73758 -1.083478
H  -1.818215 -2.345429 -0.602991
H  -1.241365 -1.664824 -2.143881
H  3.42173 -1.166608 -1.6300
H  -2.0990 0.425767 -2.911188
H  3.475229 1.906817 2.330481
H  -3.864103 1.502096 1.652598
H  5.560528 -0.747059 -0.408519
H  -3.469862 2.487155 -2.561458
H  5.599279 0.791819 1.580224
H  -4.350611 3.042482 -0.271757
