program: Gaussian 09
title: 000272981
version: EM64L-G09RevD.01
frameworkgroup: C1[X(C13H19NO3)]
method: RPBEPBE
basis: SDD
operation: Freq
keyword: #p
keyword: freq=noraman
keyword: PBEPBE/SDD
title: #p freq=noraman PBEPBE/SDD
converged: NO YES NO NO
title: Mulliken charges:
elementType: O O O N C C C C C C C C C C C C C H H H H H H H H H H H H H H H H H H H
charge: -0.265768 -0.306139 -0.297606 -0.111584 0.248123 -0.215632 0.549082 -0.738682 -0.707238 -0.697182 -0.565669 -0.357997 0.225266 -0.334004 0.188362 -0.529982 -0.529975 0.228525 0.203145 0.226656 0.254338 0.238194 0.219569 0.214145 0.237060 0.199653 0.230499 0.252877 0.274083 0.250764 0.253625 0.230619 0.222159 0.254628 0.230194 0.225892
chargesum: 0.00000
title: Mulliken charges with hydrogens summed into heavy atoms:
elementType: O O O N C C C C C C C C C C C C C
charge: -0.265768 -0.306139 -0.297606 -0.111584 0.248123 0.012893 0.549082 -0.054543 -0.035330 -0.029970 -0.312792 -0.083914 0.225266 -0.083240 0.188362 0.176421 0.180739
polarizability: 2.37105542e+02 -3.58972649e+00 1.46889111e+02 -1.90928691e+00 -6.97320098e+00 1.13544858e+02
1716.lowfreq: -8.7718 -0.0008 -0.0006 0.0001 3.6213 8.4584 29.1180 44.0899 56.1750
frequency: 27.7023 44.0784 56.1330 80.9460 95.3683 110.0208 123.2368 155.3072 168.3765 179.4655 185.2843 206.8884 218.2397 239.8991 244.6422 257.0870 276.3336 314.0221 326.8356 343.3529 353.5254 397.0194 407.3752 436.4359 477.4332 493.2627 502.5108 557.4646 593.9209 624.3801 690.4054 711.7370 732.6352 755.7822 769.7736 784.8586 845.4552 850.4408 887.0500 899.5420 921.6350 926.3529 944.9617 949.6763 963.2465 978.6867 1016.1548 1023.5943 1086.2120 1088.4338 1112.5866 1115.3604 1136.1611 1152.1129 1153.4544 1168.6884 1199.3556 1206.3239 1242.0767 1243.8782 1246.9765 1283.6598 1338.1575 1369.9243 1371.9805 1379.1442 1397.7221 1414.3795 1424.5745 1447.1399 1451.0971 1456.9045 1459.5618 1466.2870 1469.0993 1474.2123 1477.2283 1481.5911 1488.2769 1489.9402 1497.4764 1576.2080 1616.0309 2970.5518 2973.0598 2979.0097 2982.7046 2988.7101 3066.7779 3067.8344 3069.3387 3075.2556 3080.7489 3084.9642 3089.7535 3093.2220 3096.2311 3121.6054 3122.2103 3135.8709 3152.8082 3176.5221
redmass: 3.5487 3.7243 3.6969 3.6121 4.3686 2.8267 3.3071 1.1608 1.2406 2.0905 1.3642 2.3522 2.5756 1.0332 3.8693 1.9359 1.8312 3.5203 3.6726 2.7120 4.2378 3.4637 3.9915 3.9159 3.2827 3.4735 3.4379 5.9300 5.2481 4.7161 7.0430 5.3431 5.4732 3.4350 4.4722 5.0686 1.6405 3.3890 4.3910 1.6536 1.5644 1.6447 7.9227 1.2088 1.3697 4.4103 1.4368 1.4058 2.0757 1.4840 1.2418 1.2426 1.8076 1.2974 1.4589 2.4788 1.9710 2.2650 3.3363 1.8398 3.3089 2.3258 2.4834 1.2803 1.2141 4.0018 1.2056 1.5688 1.1971 1.4662 1.0854 1.0586 1.0739 1.0483 1.0546 1.0604 1.0651 1.0599 1.1201 2.5429 1.0596 7.3428 6.5472 1.0310 1.0309 1.0356 1.0348 1.0352 1.1037 1.0908 1.1043 1.0965 1.0985 1.1003 1.1001 1.0998 1.0998 1.1027 1.1027 1.0917 1.0886 1.0965
irintensity: 0.4529 1.7211 1.4632 3.5561 3.0203 8.6747 0.2627 0.2631 1.8184 5.8296 1.6760 0.1539 1.4278 0.4653 11.0199 6.1054 1.2600 1.1245 4.0180 4.2868 0.1379 2.2900 7.0923 0.6455 2.3544 2.9453 9.6304 8.9058 22.5341 23.3405 5.7121 5.7927 20.0765 3.1194 10.4369 29.2843 22.0367 2.1051 22.4307 20.5372 1.5724 1.3602 66.1466 0.2428 1.3673 56.9858 0.1192 0.3452 59.8528 11.0662 14.4591 6.2616 7.2603 2.5564 0.9287 8.9243 96.1770 20.4332 45.6887 66.1886 10.0671 143.4432 26.6225 35.6443 26.9455 16.6284 12.3966 30.0732 2.2132 37.9840 9.2343 14.2027 2.8894 0.5193 5.9040 14.3997 9.0963 9.7888 2.4991 107.2845 20.8082 9.0264 9.1507 81.4736 66.9253 19.8306 24.8659 23.1894 28.8178 25.7305 22.0116 5.3188 52.3560 2.7891 20.6035 37.2850 42.5911 23.1261 25.5493 5.3557 3.7419 2.6847
temp: 298.150 k
press: 1.00000 atm
elementType: 8 8 8 7 6 6 6 6 6 6 6 6 6 6 6 6 6 1 1 1 1 1 1 1 1 1 1 1 1 1 1 1 1 1 1 1
symmnumber: 1
zpe: 774330.4 jmol-1
zpe.correction: 0.294927 hartree
zpe.thermalcorrener: 0.313823 hartree
zpe.thermalcorrenthalpy: 0.314767 hartree
zpe.thermalcorrgfe: 0.247890 hartree
zpe.sumelectzpe: -785.777276 hartree
zpe.sumelectthermal: -785.758380 hartree
zpe.sumelectthermalent: -785.757436 hartree
zpe.sumelectthermalfe: -785.824313 hartree
dipole: -0.5085 2.4381 1.0776
dipole: 2.7137
quadrupole: -83.2954 -98.5118 -106.8131
quadrupole: 4.3580 3.9821 1.1255
quadrupole: 12.9113 -2.3050 -10.6063 4.3580 3.9821 1.1255
hfenergy: -786.072203 hartree
pointgroup: C01 [X(C13H19N1O3)]
dipole: 0.1032445 -1.0537841 -0.1370865 debye
polarizability: 235.4417594|-13.7715165|133.3073816|1.7469474|17.9185022|128.7903695 unknown
InChI: InChI=1S/C13H19NO3/c1-13(2,3)14-12(17-14)9-6-7-10(15-4)11(8-9)16-5/h6-8,12H,1-5H3
charge 0 multiplicity 1
36 atoms
O  -2.189653 1.657181 -0.815343
O  3.048932 -1.415373 -1.346372
O  3.937928 0.129027 0.985022
N  -2.587866 0.5755 0.274268
C  -3.984684 0.011291 0.015724
C  -1.532741 0.315195 -0.736068
C  -0.117715 0.244021 -0.277408
C  -4.312643 -0.320077 -1.459808
C  -4.019647 -1.261344 0.899595
C  -4.955731 1.086116 0.554424
C  0.813272 -0.544947 -0.993491
C  0.31056 0.962986 0.868318
C  2.161191 -0.615965 -0.586657
C  1.66041 0.914142 1.264377
C  2.59833 0.147031 0.535185
C  3.645694 -2.548426 -0.600382
C  4.929637 0.648134 0.01224
H  -1.782451 -0.331097 -1.591309
H  -3.792144 -1.229584 -1.812429
H  -5.397457 -0.501806 -1.560822
H  -4.045258 0.527918 -2.115797
H  -3.777179 -1.01527 1.948032
H  -3.297526 -2.019024 0.543218
H  -5.030389 -1.706404 0.867513
H  -4.913709 1.991339 -0.07655
H  -5.99216 0.702941 0.557303
H  -4.678882 1.370671 1.584457
H  0.511853 -1.12509 -1.873873
H  -0.420553 1.559377 1.421548
H  2.022555 1.474725 2.132179
H  4.194687 -2.191998 0.289934
H  4.331964 -3.036576 -1.309004
H  2.854369 -3.25809 -0.292013
H  4.885888 0.086621 -0.938233
H  5.909066 0.516893 0.496694
H  4.743753 1.722063 -0.178271
