program: Gaussian 09
title: 000272961
version: EM64L-G09RevD.01
frameworkgroup: C1[X(C16H15N3O3)]
method: RPBEPBE
basis: SDD
operation: Freq
keyword: #p
keyword: freq=noraman
keyword: PBEPBE/SDD
title: #p freq=noraman PBEPBE/SDD
converged: YES YES NO NO
title: Mulliken charges:
elementType: O O O N N N C C C C C C C C C C C C C C C C H H H H H H H H H H H H H H H
charge: -0.265006 -0.385860 -0.270400 -0.471756 -0.319076 -0.071043 0.362431 0.491470 -0.360173 -0.335995 -0.368485 -0.477100 -0.082145 0.250714 0.133007 0.302151 -0.341991 -0.356187 -0.766092 -0.222582 -0.236750 -0.226076 0.237824 0.260268 0.309199 0.219192 0.312479 0.274781 0.216207 0.267768 0.261579 0.235012 0.234197 0.231184 0.234333 0.348619 0.374302
chargesum: 0.00000
title: Mulliken charges with hydrogens summed into heavy atoms:
elementType: O O O N N N C C C C C C C C C C C C C C C C
charge: -0.265006 -0.011558 -0.270400 -0.159276 0.029543 -0.071043 0.362431 0.491470 -0.122349 -0.075727 -0.059286 -0.257909 -0.082145 0.250714 0.133007 0.302151 -0.067209 -0.139980 -0.001733 0.011615 -0.005566 0.008257
polarizability: 4.16104874e+02 1.30682868e+01 1.97000578e+02 -8.85766771e+00 1.34460460e+01 1.24040725e+02
1716.lowfreq: -5.2720 -2.4176 0.0004 0.0006 0.0011 3.0264 21.2360 25.4519 46.4344
frequency: 21.2115 25.4264 46.4336 51.6435 64.9995 74.3094 99.2383 117.6749 135.5853 152.8731 165.1216 175.5998 188.7269 237.9840 260.2201 275.6989 285.3852 313.1359 335.3278 351.7862 380.1595 401.8946 409.0733 415.8701 435.6247 472.1873 481.0739 532.8531 557.8154 610.5124 614.2564 637.9155 642.9447 657.6466 675.1906 685.7359 702.8414 711.7471 742.6651 789.1511 798.7819 820.7719 827.1011 852.9332 861.5997 868.3202 932.6314 933.9907 944.5485 982.9995 986.1937 988.1234 989.2015 1004.0659 1005.7050 1023.8750 1033.5320 1039.4355 1080.0991 1083.3677 1094.3133 1130.6728 1174.2281 1191.3536 1193.8419 1201.9342 1244.7198 1263.1830 1286.8361 1308.0425 1318.7219 1322.0102 1356.6271 1359.9423 1384.7938 1401.6430 1412.3219 1429.4575 1434.4584 1444.3045 1468.0050 1475.3704 1494.2949 1508.0751 1555.2413 1573.5047 1585.3149 1608.8182 1609.5931 1620.6290 2998.4090 3080.4249 3111.4900 3112.8195 3125.1326 3132.9462 3139.5020 3145.7819 3159.1966 3170.7788 3182.4595 3195.9175 3294.2412 3499.6166 3530.4209
redmass: 6.0097 4.6212 5.5968 5.5633 4.6654 4.0089 5.7776 3.1674 2.8979 2.3133 3.3776 6.0040 5.7819 5.1939 4.5282 8.6406 3.3753 2.1348 3.5507 2.8368 4.7726 2.8090 3.2807 4.0263 4.6174 6.2251 4.6322 2.7965 6.3733 4.6748 6.2516 5.6786 1.4237 3.7854 4.0739 4.9185 1.5196 5.7920 3.9847 2.4733 2.0741 1.7032 3.3758 1.3324 1.6228 3.6160 2.0461 1.4859 1.4703 1.4315 2.0655 1.5923 4.9897 2.9750 1.3476 2.5198 1.9538 1.5444 2.0127 3.5267 2.2646 1.4557 1.0583 1.1342 1.4311 1.5506 3.3049 2.0072 1.4039 1.6115 1.3473 2.5447 2.5474 4.2699 9.0483 1.2517 3.7752 2.6113 2.2558 1.1588 1.3609 2.0838 2.2307 2.8221 3.9766 7.4662 4.2609 5.0401 6.0355 6.3961 1.0391 1.0942 1.0902 1.0881 1.1000 1.0867 1.0905 1.0918 1.0956 1.1006 1.0944 1.0946 1.0773 1.0684 1.0758
irintensity: 2.4383 1.6552 0.5743 3.8350 1.3777 0.5296 4.2561 4.9559 10.7769 0.7644 1.7339 0.1390 10.9142 5.2930 21.5650 11.5620 35.8561 56.1447 49.5465 13.0544 4.3307 0.2325 0.4020 1.6894 8.4777 2.8636 0.6884 32.2427 1.5664 3.7714 0.8557 7.0655 23.4434 40.5527 2.8841 10.5921 105.0936 1.1616 25.3784 13.4294 416.7061 14.7187 4.1472 0.6758 26.9849 23.1409 31.0109 4.6081 14.4445 2.8211 35.0650 10.2489 1.1344 18.3928 1.4986 21.7395 19.0877 3.5652 21.0514 40.4057 5.6110 23.3022 1.9491 13.5275 69.6913 65.5208 108.5751 36.6195 71.5161 23.5016 1.6608 145.3240 287.2861 69.5725 2.8182 40.4152 37.9984 22.8262 9.9620 24.2353 38.8817 58.7391 178.2928 310.0718 145.1178 90.1110 56.1897 58.1098 7.1050 32.9325 5.7407 15.5759 27.6206 12.2325 7.1519 0.6123 10.5044 20.6758 16.5159 25.5043 3.2027 6.8907 24.6827 60.0635 10.8497
temp: 298.150 k
press: 1.00000 atm
elementType: 8 8 8 7 7 7 6 6 6 6 6 6 6 6 6 6 6 6 6 6 6 6 1 1 1 1 1 1 1 1 1 1 1 1 1 1 1
symmnumber: 1
zpe: 737642.6 jmol-1
zpe.correction: 0.280953 hartree
zpe.thermalcorrener: 0.301330 hartree
zpe.thermalcorrenthalpy: 0.302274 hartree
zpe.thermalcorrgfe: 0.229893 hartree
zpe.sumelectzpe: -1006.963391 hartree
zpe.sumelectthermal: -1006.943015 hartree
zpe.sumelectthermalent: -1006.942070 hartree
zpe.sumelectthermalfe: -1007.014451 hartree
dipole: 0.2968 -0.8133 4.6250
dipole: 4.7053
quadrupole: -81.3322 -133.5109 -129.0292
quadrupole: 25.8808 -15.4240 7.0480
quadrupole: 33.2919 -18.8868 -14.4051 25.8808 -15.4240 7.0480
hfenergy: -1007.2443443 hartree
pointgroup: C01 [X(C16H15N3O3)]
dipole: 0.1441977 -1.8446397 0.0595873 debye
polarizability: 415.7987184|15.6889556|122.1098965|9.988454|2.4322824|199.2375614 unknown
InChI: InChI=1S/C16H15N3O3/c1-11(18-21)15(19-22)12-7-9-14(10-8-12)17-16(20)13-5-3-2-4-6-13/h2-10,17-18,21H,1H3
charge 0 multiplicity 1
37 atoms
O  2.426399 0.282887 -1.819109
O  -7.041845 -0.755139 -1.235527
O  -4.009751 1.471916 2.353327
N  1.85267 -0.07331 0.43059
N  -6.132155 -0.592867 -0.107626
N  -4.646233 0.84643 1.408774
C  -2.428152 -0.004461 0.444951
C  0.432588 -0.038617 0.379395
C  -1.711199 0.16004 -0.771842
C  -1.673207 -0.158005 1.642444
C  -0.30368 0.138798 -0.82242
C  -0.26924 -0.182726 1.607696
C  -3.910893 0.052708 0.49486
C  4.217876 -0.085261 -0.222216
C  2.768147 0.051256 -0.617779
C  -4.785018 -0.654578 -0.381624
C  5.180805 0.500867 -1.083687
C  4.658226 -0.79091 0.929651
C  -4.350419 -1.53005 -1.52569
C  6.555745 0.409486 -0.78652
C  6.03617 -0.886708 1.223524
C  6.987834 -0.280665 0.371071
H  -2.260839 0.342327 -1.702084
H  -2.190961 -0.258381 2.598981
H  0.231639 0.27455 -1.763194
H  0.290541 -0.306993 2.544121
H  2.249016 -0.156868 1.369208
H  4.823711 1.015586 -1.981498
H  3.944606 -1.310303 1.581966
H  -3.313163 -1.867323 -1.382733
H  -4.406641 -0.979693 -2.483037
H  -5.017055 -2.403199 -1.619986
H  7.289983 0.872312 -1.454706
H  6.367068 -1.441965 2.107934
H  8.056313 -0.354865 0.601509
H  -6.397865 0.142218 0.578783
H  -7.642924 -1.501592 -0.965308
