program: Gaussian 09
title: 000272939
version: EM64L-G09RevD.01
frameworkgroup: C1[X(C10H7N3O3)]
method: RPBEPBE
basis: SDD
operation: Freq
keyword: #p
keyword: freq=noraman
keyword: PBEPBE/SDD
title: #p freq=noraman PBEPBE/SDD
converged: YES YES NO NO
title: Mulliken charges:
elementType: O O O N N N C C C C C C C C C C H H H H H H H
charge: -0.273277 -0.206198 -0.205144 -0.068127 0.032191 0.003712 0.180311 0.350799 -0.299926 0.347582 -0.231805 -0.393020 -0.234931 -0.445815 -0.182932 -0.325394 0.277663 0.299757 0.298578 0.324103 0.267799 0.235331 0.248740
chargesum: 0.00000
title: Mulliken charges with hydrogens summed into heavy atoms:
elementType: O O O N N N C C C C C C C C C C
charge: -0.273277 -0.206198 -0.205144 -0.068127 0.032191 0.003712 0.180311 0.350799 -0.022263 0.347582 0.067952 -0.094441 0.089172 -0.178015 0.052400 -0.076654
polarizability: 2.82049678e+02 3.53936355e+00 1.44686399e+02 8.74760289e-02 -6.90059325e-02 5.21240699e+01
1716.lowfreq: -6.9908 -0.0004 -0.0003 0.0003 8.9146 10.5230 26.1212 37.4356 68.6461
frequency: 25.1117 37.3828 68.6108 91.2149 104.5214 207.4946 223.2256 244.3604 285.9813 311.5471 406.3244 421.1445 423.9349 489.2081 497.1261 500.5049 580.9891 606.0820 640.1046 658.9328 673.7175 713.3148 742.5670 751.9430 790.0534 815.1573 846.7482 868.9514 912.3677 941.3004 947.4170 981.4325 995.1994 997.5479 998.3213 1026.2226 1098.9104 1105.8834 1128.5890 1163.2813 1196.2895 1217.0912 1260.9650 1275.4476 1314.8280 1325.5503 1341.1834 1359.0420 1386.9465 1417.0948 1440.8317 1444.6813 1551.2227 1556.8566 1565.9214 1586.9158 3141.4813 3147.1392 3165.8661 3174.5793 3180.4918 3197.7996 3213.6839
redmass: 5.3380 8.8295 7.4370 7.5887 7.5514 7.6765 4.6782 8.3688 7.0247 5.8965 3.3143 3.7071 8.7232 3.7723 3.6449 8.5159 8.4921 7.5654 7.6485 10.3856 6.8101 2.3042 9.0892 5.4007 9.7828 1.4539 1.4590 7.4125 1.4027 1.4370 1.4554 3.7042 1.3243 4.0141 1.3349 2.8941 2.0108 1.6316 1.6012 3.0040 1.3268 9.2041 2.3649 2.0947 1.8491 2.9335 4.6307 7.2286 5.7279 2.3540 2.3534 2.0933 6.8123 7.1953 6.3117 6.5591 1.0877 1.0924 1.0977 1.0932 1.0899 1.0989 1.0954
irintensity: 4.4138 0.0006 0.8640 3.1035 3.6009 2.5334 2.4716 0.1880 0.0384 3.8918 3.5245 1.5135 0.2991 0.8456 3.0013 4.4449 2.2097 7.3971 1.3123 16.0017 13.5683 24.7461 9.2993 10.7240 6.3857 64.7979 40.3384 27.4198 5.2304 3.0218 11.6004 7.8926 1.4402 31.1304 2.6154 3.0553 8.3882 30.3691 38.8033 85.5279 11.6437 704.1526 259.9667 80.8291 0.4984 41.9748 27.8675 173.0394 89.2965 73.8995 234.0360 30.5359 38.3001 60.4763 31.4684 252.0049 7.3059 10.5461 22.4414 0.9299 1.4721 2.0368 9.6075
temp: 298.150 k
press: 1.00000 atm
elementType: 8 8 8 7 7 7 6 6 6 6 6 6 6 6 6 6 1 1 1 1 1 1 1
symmnumber: 1
zpe: 417404.8 jmol-1
zpe.correction: 0.158981 hartree
zpe.thermalcorrener: 0.171670 hartree
zpe.thermalcorrenthalpy: 0.172614 hartree
zpe.thermalcorrgfe: 0.117615 hartree
zpe.sumelectzpe: -773.960661 hartree
zpe.sumelectthermal: -773.947973 hartree
zpe.sumelectthermalent: -773.947029 hartree
zpe.sumelectthermalfe: -774.002027 hartree
dipole: 1.9583 -0.3425 -0.0258
dipole: 1.9882
quadrupole: -125.5927 -83.2475 -92.6447
quadrupole: 16.0390 -0.0388 -0.0253
quadrupole: -25.0977 17.2475 7.8502 16.0390 -0.0388 -0.0253
hfenergy: -774.1196426 hartree
pointgroup: C01 [X(C10H7N3O3)]
dipole: -0.7622671 -0.1315179 0.1162253 debye
dipolederiv: -2.6732581 -0.0493007 -0.1518839 -0.2145808 -0.2447646 0.0528543 0.0551695 0.0683098 -0.269802 -1.0165308 0.0613907 -0.1437191 0.1465877 -0.3429498 0.1492628 -0.2506612 0.142081 -0.4348787 -0.6642024 -0.1124486 0.1047423 -0.2822319 -0.4557634 0.2650638 0.3192978 0.279571 -0.5520863 -0.9011 -0.0680824 0.0271259 -0.5187268 -0.3294455 0.1035298 0.5989409 0.1422683 -0.3409698 2.2360498 0.184553 -0.0608389 0.326453 0.5834575 -0.447074 -0.2413087 -0.4594128 0.7656566 -0.3118717 -0.0214483 0.0203646 -0.0061577 -0.2483583 0.0075739 0.0029488 0.006182 -0.249179 2.3877133 0.1768439 -0.0366337 0.5999629 0.2813278 -0.0664154 -0.5693503 -0.1033462 0.2702139 -1.1136816 -0.0944018 0.019242 -0.3237143 -0.0660793 0.1332972 0.3087706 0.1527941 -0.1052284 -0.9665029 -0.0563762 0.000242 0.1398611 -0.053934 -0.0885743 -0.2470362 -0.1051699 -0.0216207 1.5548619 -0.149949 0.3106667 -0.321556 0.0965521 0.0420855 0.530404 0.0560064 0.1294244 0.4743225 0.0330288 0.0040814 0.3557127 0.0419083 -0.1063688 -0.4034279 -0.1336633 0.0682239 0.7240988 0.0323902 0.0216204 0.0634628 0.077844 -0.1042371 -0.0190607 -0.1069505 0.1242259 -0.1619735 0.0031568 -0.007503 0.0708833 -0.0876983 -0.0271411 -0.0929302 -0.0341157 -0.0813068 -0.1372433 0.0877074 -0.1115585 -0.0050926 0.0578977 -0.1893544 0.0006558 -0.1802852 0.1308137 -0.275853 0.0195617 -0.038482 -0.1135235 -0.0196911 -0.1157026 0.1259724 -0.1042026 0.0351303 0.2804795 -0.083211 0.137465 0.0779211 -0.0329525 -0.0608655 -0.0618266 -0.0751036 0.0009142 0.0915902 -0.0261461 0.0260328 -0.0213987 0.1061644 0.0825653 0.0198694 0.0820025 0.0710343 0.087788 0.0363381 -0.0526589 0.0012929 0.1457159 0.0278204 -0.0083333 0.030745 0.1281287 0.0977344 -0.0158479 0.0163742 -0.0239605 0.1028433 0.0474851 0.0270285 0.0480803 0.0836199 0.1962525 -0.0383614 0.048776 -0.0657323 0.1339355 0.035317 0.0816989 0.0380028 0.1268117 0.1100369 0.0269647 -0.0372355 0.041995 0.075611 0.0930498 -0.0554971 0.09183 0.0286828 0.0667548 0.0069688 -0.0166991 0.0369633 0.0618155 0.1210243 -0.0540343 0.118496 0.0052085 -0.0854651 0.0466694 -0.0795208 0.0355796 0.1165638 0.0448041 -0.0672901 0.0458805 0.0869829 unknown
polarizability: 281.4013234|11.6737765|88.6859984|5.0966958|-44.8342912|108.7728255 unknown
InChI: InChI=1S/C10H7N3O3/c14-13(15)8-3-4-10(12-6-8)16-9-2-1-5-11-7-9/h1-7H
charge 0 multiplicity 1
23 atoms
O  -1.070743 -0.799758 0.81064
O  5.155786 0.041044 0.274932
O  4.399839 1.350635 -1.440588
N  0.457003 0.406071 -0.582835
N  4.20945 0.548638 -0.445201
N  -4.698951 -0.743598 0.401345
C  0.21523 -0.433606 0.456926
C  2.822418 0.187157 -0.106195
C  1.235015 -1.008649 1.269924
C  -2.292262 -0.402311 0.200938
C  2.565582 -0.689756 0.979648
C  1.753394 0.712832 -0.860751
C  -2.458315 0.471525 -0.897831
C  -3.428157 -0.98514 0.818484
C  -3.783034 0.7191 -1.327543
C  -4.864609 0.10196 -0.662401
H  0.959261 -1.675678 2.089169
H  3.399393 -1.093098 1.559416
H  1.944131 1.388992 -1.698459
H  -1.594395 0.925135 -1.382113
H  -3.296381 -1.661611 1.669642
H  -3.967164 1.388177 -2.173978
H  -5.898893 0.277635 -0.976369
