program: Gaussian 09
title: 000273114
version: EM64L-G09RevD.01
frameworkgroup: C1[X(C28H16O8)]
method: RPBEPBE
basis: SDD
operation: Freq
keyword: #pfreq=noraman
keyword: PBEPBE/SDD
title: #p freq=noraman PBEPBE/SDD
converged: YES YES NO NO
title: Mulliken charges:
elementType: O O O O O O O O C C C C C C C C C C C C C C C C C C C C C C C C C C C C H H H H H H H H H H H H H H H H
charge: -0.334354 -0.335652 -0.335625 -0.334273 -0.207420 -0.208093 -0.208071 -0.207382 0.171350 0.172565 0.172617 0.171443 0.323782 0.324115 0.324078 0.323666 0.148244 0.149368 0.149423 0.148099 -0.329484 -0.330604 -0.330629 -0.329550 -0.335127 -0.333441 -0.333544 -0.335142 -0.240034 -0.239823 -0.239808 -0.240029 -0.210520 -0.210926 -0.210901 -0.210543 0.275151 0.275151 0.275144 0.275151 0.261527 0.261444 0.261473 0.261508 0.238622 0.238630 0.238630 0.238620 0.237810 0.237777 0.237778 0.237812
chargesum: 0.00000
title: Mulliken charges with hydrogens summed into heavy atoms:
elementType: O O O O O O O O C C C C C C C C C C C C C C C C C C C C C C C C C C C C
charge: -0.334354 -0.335652 -0.335625 -0.334273 -0.207420 -0.208093 -0.208071 -0.207382 0.171350 0.172565 0.172617 0.171443 0.323782 0.324115 0.324078 0.323666 0.148244 0.149368 0.149423 0.148099 -0.054333 -0.055454 -0.055485 -0.054400 -0.073600 -0.071997 -0.072071 -0.073634 -0.001412 -0.001193 -0.001179 -0.001409 0.027289 0.026850 0.026877 0.027270
polarizability: 3.94932961e+02 5.00266985e-04 2.91139558e+02 3.11959570e-03 -5.87724848e-01 2.90514849e+02
1716.lowfreq: 0.0006 0.0009 0.0010 4.8290 7.2226 7.2486 20.3216 31.7715 34.2095
frequency: 20.2982 31.7704 34.2092 40.6276 42.6001 43.2228 60.6725 69.3785 70.7758 98.5353 103.0241 116.9361 117.4289 134.4457 148.2495 175.2243 176.6543 177.7863 189.1270 241.1676 242.2091 271.4634 299.0481 301.1410 301.8087 342.9628 346.0614 350.3357 350.8907 361.0703 422.8018 431.0865 431.4837 441.9128 475.3845 487.9277 493.1312 494.4245 520.7832 523.2137 523.4456 525.8439 565.0594 577.6585 578.1261 591.3330 640.0417 650.4722 650.7754 657.5072 663.2648 663.4436 667.3013 670.6048 721.9205 722.4192 722.5028 735.6174 767.0722 775.2129 775.5132 776.6942 794.3039 795.5878 795.7297 796.9375 811.1465 830.7474 830.9691 848.8905 889.7966 891.0162 891.0766 891.2763 971.0816 971.4869 971.6826 972.2743 981.4356 1000.1617 1000.2193 1000.3062 1000.3452 1002.9408 1003.3726 1018.3983 1046.4391 1047.5744 1049.1226 1049.3228 1091.9528 1095.2489 1095.3340 1105.8265 1160.4088 1171.3916 1171.5318 1172.5839 1174.3103 1180.5075 1180.7555 1198.4315 1222.6738 1228.1483 1228.3496 1236.8604 1274.1107 1274.5931 1274.6599 1278.1569 1381.5375 1382.1060 1382.1742 1383.0641 1432.2372 1433.8897 1433.8989 1438.7376 1466.4810 1471.8856 1472.0553 1475.6730 1575.7118 1576.9070 1577.2226 1579.1473 1611.2487 1612.6600 1612.7817 1614.6751 1635.2112 1638.9162 1639.6152 1641.2961 3141.5202 3141.5421 3141.5581 3141.5794 3154.3746 3154.3935 3154.4414 3154.4589 3167.6349 3167.6894 3167.6960 3167.7291 3178.1923 3178.2020 3178.2139 3178.3114
redmass: 6.0670 11.0140 6.0399 8.0395 7.8554 6.7896 6.5456 6.3807 6.3644 8.0734 7.1217 5.2675 5.3056 5.1151 5.9493 6.7595 7.4825 7.4676 6.7589 6.0533 6.0379 6.2970 6.9316 7.8153 7.8254 7.5411 8.1453 9.4475 9.3965 11.8860 3.7702 3.8568 3.8626 3.9510 5.6517 5.2049 5.1557 5.0837 5.5525 5.2280 5.1999 5.1374 6.8229 7.8663 7.8389 7.5387 6.2917 6.1308 6.1445 5.1596 5.0363 5.0311 5.3290 5.3672 3.8998 3.3330 3.8693 4.0480 2.9739 2.1390 2.1441 2.4283 2.8380 2.6360 2.6827 2.0336 3.7951 5.7707 5.7471 5.5208 1.5533 1.5215 1.5705 1.5181 1.3846 1.3837 1.3845 1.3857 8.7217 1.3493 1.4019 1.3491 1.4121 5.7954 6.1240 6.2623 2.3512 2.2922 2.2471 2.2504 2.2654 2.2448 2.2401 1.9543 2.3515 1.1486 1.1443 1.0637 1.1471 2.4165 2.4396 3.2494 2.3970 2.6314 2.6453 2.6823 1.7079 1.6389 1.6390 1.6677 10.8009 10.8918 10.8830 10.8068 2.3039 2.3358 2.3333 2.4604 2.4666 2.5931 2.5948 2.6621 7.0171 6.9690 6.9696 6.9109 6.7349 6.8430 6.8354 7.0726 12.8287 12.2381 12.2745 11.6679 1.0861 1.0861 1.0861 1.0861 1.0906 1.0906 1.0906 1.0905 1.0953 1.0952 1.0953 1.0953 1.1004 1.1004 1.1004 1.1004
irintensity: 0.0008 0.1098 0.5248 2.0457 2.1983 0.0009 0.8333 4.0746 3.7625 0.0107 1.1411 0.1558 0.1535 0.0158 0.0003 0.0001 0.6918 0.7217 4.3945 0.5400 0.5209 0.0000 16.2258 4.1242 4.0693 0.0000 0.1294 0.2679 0.2349 0.0004 0.0002 2.8758 2.6859 0.9080 0.0002 0.3446 14.5986 14.4176 0.0121 1.6624 1.6852 7.9792 0.0026 1.1665 1.0940 1.1678 0.0000 10.9035 10.3299 2.0788 19.1405 18.2451 0.0051 62.4513 15.4236 0.0558 17.0097 0.1126 0.0135 32.2753 31.4566 8.5388 21.5923 75.5101 74.9936 0.0098 19.9414 6.4086 6.6493 0.0000 0.0011 0.3173 0.1226 0.3440 4.7541 4.8220 0.4699 0.0572 0.0458 0.0269 8.7249 0.0120 9.2340 109.0975 112.4927 334.4120 5.7628 0.0407 20.1798 20.2965 0.0014 92.1950 91.6071 388.9557 0.0050 35.2090 33.9804 11.2726 0.0079 116.9046 118.5254 607.9036 0.0382 65.9658 69.0006 496.1457 441.8691 46.1234 45.0525 0.0001 8.9712 2.2605 2.2407 0.0070 181.1000 40.5671 40.3495 0.0009 0.0054 10.4588 10.9292 28.2020 0.0104 0.7590 0.5814 4.1182 148.9370 51.1623 52.5881 0.0304 25.8756 401.3981 396.6887 0.2148 0.5266 4.6006 0.3634 4.6115 3.3747 3.3691 11.1923 8.1004 18.2690 3.7253 9.0200 10.3044 9.9870 37.7887 10.2552 0.3695
temp: 298.150 k
press: 1.00000 atm
elementType: 8 8 8 8 8 8 8 8 6 6 6 6 6 6 6 6 6 6 6 6 6 6 6 6 6 6 6 6 6 6 6 6 6 6 6 6 1 1 1 1 1 1 1 1 1 1 1 1 1 1 1 1
symmnumber: 1
zpe: 966638.0 jmol-1
zpe.correction: 0.368173 hartree
zpe.thermalcorrener: 0.396932 hartree
zpe.thermalcorrenthalpy: 0.397876 hartree
zpe.thermalcorrgfe: 0.307345 hartree
zpe.sumelectzpe: -1675.927875 hartree
zpe.sumelectthermal: -1675.899115 hartree
zpe.sumelectthermalent: -1675.898171 hartree
zpe.sumelectthermalfe: -1675.988703 hartree
dipole: 0.0164 -0.0002 -0.0015
dipole: 0.0165
quadrupole: -156.7642 -201.0520 -200.7415
quadrupole: -0.0050 -0.0041 0.1078
quadrupole: 29.4217 -14.8661 -14.5556 -0.0050 -0.0041 0.1078
hfenergy: -1676.2960477 hartree
pointgroup: C01 [X(C28H16O8)]
dipole: -0.0003824 0.000435 0.0064503 debye
polarizability: 291.383347|0.3667535|290.2731408|-0.1672549|-0.4347009|394.9308805 unknown
InChI: InChI=1S/C28H16O8/c29-25-17-9-1-5-13-21(17)33-26(30)19-11-3-7-15-23(19)35-28(32)20-12-4-8-16-24(20)36-27(31)18-10-2-6-14-22(18)34-25/h1-16H
charge 0 multiplicity 1
52 atoms
O  0.74337 -1.56453 0.576758
O  -1.550823 -0.738114 -0.585485
O  1.552954 0.743172 -0.574306
O  -0.746148 1.560604 0.586738
O  0.248641 -3.316187 -0.886586
O  -3.333988 -0.282957 0.85171
O  3.329723 0.274409 0.866335
O  -0.24475 3.322853 -0.861565
C  -1.510362 -1.692225 1.631697
C  1.677111 -1.499802 -1.648122
C  -1.67151 1.513154 -1.642005
C  1.504051 1.678618 1.650614
C  -0.138514 -2.06427 1.577284
C  -2.049323 0.143131 -1.587484
C  2.054524 -0.130195 -1.581599
C  0.13258 2.051828 1.59423
C  0.811965 -2.223863 -0.671422
C  -2.230655 -0.829774 0.649719
C  2.227544 0.823572 0.664518
C  -0.809766 2.229463 -0.6566
C  -2.277659 -2.140963 2.742019
C  2.123533 -2.259644 -2.764348
C  -2.114221 2.281838 -2.753644
C  2.267541 2.118102 2.767241
C  0.442662 -2.849669 2.591468
C  -2.83669 -0.435264 -2.601572
C  2.844877 0.456311 -2.588703
C  -0.451772 2.82952 2.612549
C  -1.708545 -2.937829 3.751842
C  2.925013 -1.685308 -3.767657
C  -2.912721 1.715571 -3.763908
C  1.695254 2.907249 3.781317
C  -0.341105 -3.293606 3.676689
C  -3.275921 0.350151 -3.687602
C  3.287601 -0.320426 -3.679534
C  0.3283 3.264421 3.704068
H  -3.328387 -1.837092 2.786647
H  1.814924 -3.308522 -2.818864
H  -1.805257 3.33105 -2.798984
H  3.317956 1.813339 2.813252
H  1.505522 -3.097384 2.517053
H  -3.08923 -1.497008 -2.527341
H  3.096963 1.517481 -2.505287
H  -1.514229 3.078386 2.53628
H  -2.321787 -3.276008 4.593034
H  3.261749 -2.292606 -4.613735
H  -3.246711 2.329573 -4.60623
H  2.305673 3.238383 4.627355
H  0.115013 -3.909026 4.459285
H  -3.893014 -0.103391 -4.470364
H  3.906949 0.139412 -4.456825
H  -0.130306 3.873869 4.489874
