program: Gaussian 09
title: 000272920
version: EM64L-G09RevD.01
frameworkgroup: C1[X(C7H6N6S)]
method: RPBEPBE
basis: SDD
operation: Freq
keyword: #pfreq=noraman
keyword: PBEPBE/SDD
title: #p freq=noraman PBEPBE/SDD
converged: YES YES NO NO
title: Mulliken charges:
elementType: S N N N N N N C C C C C C C H H H H H H
charge: 0.312619 -0.352102 -0.298270 -0.044779 -0.048314 -0.005764 -0.002686 0.165891 0.166432 -0.345173 -0.225894 -0.376001 -0.650118 -0.101996 0.336764 0.330626 0.253393 0.251552 0.316415 0.317408
chargesum: 0.00000
title: Mulliken charges with hydrogens summed into heavy atoms:
elementType: S N N N N N N C C C C C C C
charge: 0.312619 -0.015339 0.032356 -0.044779 -0.048314 -0.005764 -0.002686 0.165891 0.166432 -0.345173 0.027499 -0.124449 -0.016296 -0.101996
polarizability: 2.25762895e+02 -4.61279330e+00 1.39153907e+02 7.99841730e-01 -1.15637241e+00 5.64687324e+01
1716.lowfreq: -7.5868 -0.0019 0.0016 0.0022 1.9509 8.8889 23.7385 65.2647 79.8954
frequency: 23.7275 65.2391 79.8899 90.8545 113.1370 182.3190 198.2425 202.9252 254.5949 366.0020 383.5313 389.0311 444.0630 449.6599 469.0545 508.4085 536.0870 582.1942 589.7581 614.0889 652.3367 695.8602 776.7351 789.1807 843.0342 875.9059 877.3336 924.7886 946.7323 956.3128 997.8488 1082.2245 1146.6548 1165.1282 1189.0655 1241.3469 1259.7481 1306.1329 1353.7529 1361.7367 1389.9599 1400.9327 1411.6417 1465.7789 1505.7109 1514.2312 1598.6006 2201.1516 3050.7165 3119.9915 3141.5641 3170.4384 3477.3891 3503.4272
redmass: 7.9055 3.5111 9.0720 4.7758 5.0550 9.5118 8.1541 8.4821 4.0705 3.5345 2.1607 6.4963 3.5663 5.7974 12.6153 5.0324 2.7571 5.5777 3.8288 4.2376 4.1856 7.6376 9.9204 11.0433 6.0420 1.5399 1.5528 1.4705 3.9598 4.4745 3.5500 7.3184 1.0867 4.9267 4.3017 1.3122 4.0023 3.9326 1.5164 2.0744 1.3031 2.2703 1.0922 1.8325 8.0546 4.9325 6.4774 12.4060 1.0567 1.1061 1.0928 1.0924 1.0784 1.0784
irintensity: 1.7607 18.4475 3.6527 5.4598 1.4477 13.6627 1.9060 0.4451 17.3171 0.3843 109.7022 20.3014 25.6704 7.7911 9.3181 56.7548 158.5931 70.4821 95.6095 91.0026 157.4618 1.8963 4.6552 33.3546 0.8023 0.8605 12.3654 11.2901 26.1389 2.8381 24.0136 3.5803 0.3583 60.6731 6.0447 2.9261 22.4005 17.9452 3.3774 110.7117 22.4929 118.1387 16.2637 24.9238 188.6219 18.6326 357.7632 10.7839 4.6178 0.0190 11.4056 13.2522 24.1328 40.2934
temp: 298.150 k
press: 1.00000 atm
elementType: 16 7 7 7 7 7 7 6 6 6 6 6 6 6 1 1 1 1 1 1
symmnumber: 1
zpe: 352516.8 jmol-1
zpe.correction: 0.134267 hartree
zpe.thermalcorrener: 0.146849 hartree
zpe.thermalcorrenthalpy: 0.147794 hartree
zpe.thermalcorrgfe: 0.093553 hartree
zpe.sumelectzpe: -995.849235 hartree
zpe.sumelectthermal: -995.836652 hartree
zpe.sumelectthermalent: -995.835708 hartree
zpe.sumelectthermalfe: -995.889949 hartree
dipole: 8.1532 0.4097 0.2092
dipole: 8.1662
quadrupole: -91.0429 -87.3944 -87.8979
quadrupole: -19.4932 0.2785 -3.0159
quadrupole: -2.2645 1.3840 0.8804 -19.4932 0.2785 -3.0159
hfenergy: -995.9835019 hartree
pointgroup: C01 [X(C7H6N6S1)]
dipole: 3.2065513 -0.1792855 -0.0897095 debye
dipolederiv: -0.5147365 0.2787825 0.0082291 0.6706696 0.0323524 0.0041817 0.0460346 0.0142258 -0.0252237 -1.106066 -0.2088434 0.2450716 0.1275594 -0.0296601 -0.0691826 0.4383127 -0.0952739 -0.2857677 -1.0592473 -0.0711581 -0.2310997 0.3365038 -0.0273031 -0.0317973 -0.4368475 -0.1426388 -0.1743441 -0.9267962 -0.3437471 -0.0221602 -0.3836886 -0.5329924 -0.0220911 0.0798804 -0.0026358 -0.2384419 -0.705802 -0.0497658 0.0090378 -0.2131537 -0.6980681 0.0120069 0.0326141 0.0137985 -0.2451869 -0.6314844 0.1796898 0.0041503 0.3292678 -0.8718539 -0.0101524 -0.0154626 0.0086836 -0.1512639 -0.3460554 -0.0104874 -0.000532 0.073579 -0.2014033 0.000935 0.0049335 0.0013133 -0.2241726 -0.8484493 0.4284132 0.0382672 0.5987362 0.2382681 0.0402172 -0.0400386 0.0198859 0.0885937 1.3065545 0.2478189 -0.1039755 -0.069567 0.4025664 0.0012834 -0.0115751 0.0500099 0.1916217 1.3800073 -0.5086383 -0.0195714 -0.7793154 0.5067457 0.005447 -0.0311912 -0.0267793 -0.0260743 1.4515086 0.2148134 0.0532826 -0.2799568 0.2870626 0.0184919 -0.0697376 0.0541668 0.0209023 0.6217916 -0.088642 -0.0010206 -0.0739525 0.5797313 -0.0139311 0.0228721 -0.0092005 -0.0329014 0.3507086 0.0998419 0.0051232 0.2141372 0.0930177 -0.0026549 0.0037193 -0.0018729 0.1946253 0.1811657 -0.0656228 -0.0054207 -0.2136715 -0.0327039 0.0013354 -0.0114314 0.0001344 -0.0300482 0.3568046 -0.0394678 -0.0559828 -0.1000533 0.1289067 0.0400829 -0.2836734 0.0369098 0.2908842 0.3490105 0.041035 0.0707008 0.0201461 0.1312569 0.0245965 0.3356096 0.0891386 0.2849936 0.0485425 -0.0620125 0.0091913 -0.077828 -0.038384 -0.0005255 -0.0546062 -0.0092461 0.1372107 0.0716518 -0.0284303 -0.0021015 -0.0081832 -0.0715554 0.0014959 -0.004682 0.0003106 0.1301477 0.0056173 -0.0073744 -0.0072353 -0.0858483 0.054366 -0.0482665 0.003591 -0.0459905 0.0430506 0.0152741 -0.0062048 0.0060457 -0.0853808 0.0496503 0.0485276 -0.0083217 0.0450606 0.051395 unknown
polarizability: 225.8153846|4.0903297|139.1096212|-0.8906664|0.7098927|56.4605288 unknown
InChI: InChI=1S/C7H6N6S/c8-1-2-14-7-5-6(10-3-11-7)13-12-4-9-5/h3-4,12-13H,2H2
charge 0 multiplicity 1
20 atoms
S  -1.744566 0.945799 0.006331
N  3.350558 -0.204901 -0.023196
N  3.578579 1.221779 0.01387
N  1.207716 1.71095 0.122667
N  1.812293 -1.999814 -0.02993
N  -0.586883 -1.571847 -0.063763
N  -5.502182 0.845799 0.063991
C  0.963589 0.305532 0.013609
C  2.018728 -0.655126 -0.024005
C  -0.34474 -0.218868 -0.028239
C  2.467466 2.076382 0.077056
C  0.498204 -2.38538 -0.040627
C  -3.13933 -0.361039 -0.02689
C  -4.434627 0.313664 0.023881
H  4.017363 -0.753188 0.529196
H  4.371724 1.515149 -0.566782
H  2.725961 3.141462 0.094983
H  0.308861 -3.462377 -0.031032
H  -3.031762 -0.955564 -0.947289
H  -3.000054 -1.031313 0.83547
