program: Gaussian 09
title: 000272931
version: EM64L-G09RevD.01
frameworkgroup: C1[X(C11H14FN5O4)]
method: RPBEPBE
basis: SDD
operation: Freq
keyword: #p
keyword: freq=noraman
keyword: PBEPBE/SDD
title: #p freq=noraman PBEPBE/SDD
converged: YES YES NO NO
title: Mulliken charges:
elementType: F O O O O N N N N N C C C C C C C C C C C H H H H H H H H H H H H H H
charge: -0.159666 -0.255845 -0.451738 -0.475979 -0.479441 -0.172518 -0.082248 -0.053015 -0.065532 -0.358846 -0.156413 -0.106703 -0.148176 -0.042895 -0.403964 0.167099 -0.232305 -0.118438 0.190033 -0.034666 -0.600494 0.266194 0.278544 0.258002 0.239070 0.262486 0.237011 0.354292 0.394758 0.328993 0.361799 0.341076 0.252614 0.254941 0.211970
chargesum: 0.00000
title: Mulliken charges with hydrogens summed into heavy atoms:
elementType: F O O O O N N N N N C C C C C C C C C C C
charge: -0.159666 -0.255845 -0.097445 -0.081221 -0.117642 -0.172518 -0.082248 -0.053015 -0.065532 -0.017770 0.109781 0.171841 0.109826 0.196175 0.095532 0.167099 0.096688 -0.118438 0.190033 -0.034666 0.119031
polarizability: 2.41973102e+02 7.92952553e+00 1.64054272e+02 -1.07264550e+00 8.69155685e+00 1.03885991e+02
1716.lowfreq: -48.2950 -6.1048 -0.0003 0.0003 0.0007 5.4879 8.7524 15.2975 34.2166
frequency: -48.2209 14.0342 33.9984 48.0969 83.6384 98.7841 112.1908 130.2755 140.1020 159.1829 183.5830 207.4914 220.7311 235.2985 260.7012 282.4002 298.5046 309.7297 325.8779 332.4024 368.5752 386.2983 405.4505 445.8907 454.8735 469.7867 553.3498 555.5514 570.6368 623.6931 639.2810 663.3216 686.0242 700.8518 719.4495 721.6210 733.3303 764.6152 782.8065 808.1562 811.7606 878.5521 882.8968 921.4227 938.4360 947.5920 960.8390 973.0352 996.4695 1001.3084 1032.4960 1041.7357 1083.2090 1101.2467 1123.0276 1127.8676 1146.0957 1152.2512 1166.4398 1174.9722 1206.4235 1209.9784 1263.9563 1273.2309 1277.5722 1303.3668 1307.8791 1315.3286 1326.4797 1327.4953 1347.6514 1356.1239 1373.4493 1379.3040 1392.8295 1413.6519 1422.6142 1431.3888 1456.3975 1457.0035 1467.3210 1481.2813 1506.5384 1555.5231 1624.6419 2993.1174 3002.2132 3029.5558 3030.9588 3031.7226 3037.7115 3074.0391 3113.7130 3121.6525 3214.8345 3416.5537 3567.0810 3572.7850 3593.4727
redmass: 1.0178 5.8870 6.5258 5.4571 4.9530 3.8158 4.6848 4.1953 7.6568 4.2776 6.0211 6.5123 5.8067 7.9968 4.1160 2.6419 1.6541 1.4812 3.8481 4.1342 4.0143 5.4411 6.3362 6.8436 6.0932 10.6044 1.5181 3.0348 4.2865 7.6629 6.4654 6.7363 12.0777 1.5129 2.2112 4.8830 5.4167 7.4285 10.8934 6.5548 5.2614 2.0194 2.0284 3.1308 4.7906 2.2885 5.8387 4.1921 5.1485 3.1709 3.1382 2.1001 3.9787 1.8873 1.2868 2.3070 2.3205 1.7993 1.4494 2.0607 1.2389 2.4184 1.3071 1.2107 2.4105 1.5029 1.3370 1.3426 8.2519 1.3898 1.4314 1.2411 7.5074 4.3710 1.5583 1.6331 1.5498 2.7642 1.2263 1.4080 1.0756 1.5417 2.0730 7.0820 6.3927 1.0341 1.0853 1.0759 1.0756 1.0840 1.0893 1.1012 1.1015 1.1035 1.1018 1.0654 1.0780 1.0665 1.0669
irintensity: 0.0451 0.5119 3.4811 1.5027 11.1550 3.9504 8.2248 4.6964 0.1707 2.4670 0.7484 4.6908 2.0310 0.5545 24.5211 42.4829 102.6829 97.0920 9.8550 51.7587 33.6125 3.1481 4.2997 2.1900 17.9894 0.8537 64.2475 39.0606 4.9253 10.8019 18.8426 2.6309 6.4690 105.0554 67.1417 23.3506 20.1339 41.2519 13.8540 52.3198 5.2398 59.8079 12.3638 68.9221 137.1540 28.5870 35.2790 14.5360 97.8758 67.0767 147.7395 2.4469 1.7821 18.4050 1.5863 1.5188 47.8785 4.4072 47.9615 35.0965 36.9117 187.8459 1.9996 16.9673 13.2928 31.9049 7.3898 19.1342 284.2596 35.9074 41.0007 9.9105 47.7125 137.3867 24.3775 16.7075 22.4862 11.5899 13.4141 10.9187 8.0338 26.2688 11.8266 118.0611 722.4464 66.2415 23.6566 24.2587 49.2085 3.6811 33.6801 24.9047 21.1471 17.8827 62.3309 123.8715 75.9071 14.4487 17.5470
temp: 298.150 k
press: 1.00000 atm
elementType: 9 8 8 8 8 7 7 7 7 7 6 6 6 6 6 6 6 6 6 6 6 1 1 1 1 1 1 1 1 1 1 1 1 1 1
symmnumber: 1
zpe: 689462.2 jmol-1
zpe.correction: 0.262602 hartree
zpe.thermalcorrener: 0.281370 hartree
zpe.thermalcorrenthalpy: 0.282314 hartree
zpe.thermalcorrgfe: 0.214232 hartree
zpe.sumelectzpe: -1100.467436 hartree
zpe.sumelectthermal: -1100.448669 hartree
zpe.sumelectthermalent: -1100.447725 hartree
zpe.sumelectthermalfe: -1100.515807 hartree
dipole: 4.0616 -2.4321 -0.6716
dipole: 4.7814
quadrupole: -95.5247 -127.8724 -121.3651
quadrupole: 19.5182 12.2771 -7.6831
quadrupole: 19.3960 -12.9517 -6.4444 19.5182 12.2771 -7.6831
hfenergy: -1100.7300384 hartree
pointgroup: C01 [X(C11H14F1N5O4)]
dipole: 1.5902329 -0.8749282 -0.4944121 debye
polarizability: 241.5666833|9.7341238|159.2946044|-5.1588788|18.3289951|109.0520775 unknown
InChI: InChI=1S/C11H14FN5O4/c1-13-8-5-9(16-11(12)15-8)17(3-14-5)10-7(20)6(19)4(2-18)21-10/h3-4,6-7,10,13,18-20H,2H2,1H3
charge 0 multiplicity 1
35 atoms
F  -3.51954 2.489531 1.317308
O  2.217615 0.468785 1.117248
O  2.936659 2.560482 -1.148993
O  3.30661 -1.019387 -1.55507
O  5.098719 -1.793119 0.37555
N  0.281421 0.080586 -0.292999
N  -0.931683 -1.766882 -0.917823
N  -1.564258 1.488385 0.601188
N  -3.740639 0.365369 0.442657
N  -4.003097 -1.80708 -0.465119
C  2.373909 1.207934 -1.186816
C  1.39917 0.983192 0.007275
C  3.565971 0.27002 -0.912588
C  3.598768 0.177485 0.639411
C  3.975238 -1.225036 1.159125
C  -1.05078 0.351993 0.04031
C  0.292531 -1.21176 -0.86575
C  -1.781042 -0.795512 -0.353003
C  -3.193061 -0.762506 -0.128754
C  -2.898165 1.372416 0.750449
C  -5.454852 -1.797864 -0.249919
H  1.896764 0.983349 -2.158919
H  0.929623 1.925574 0.345674
H  4.488444 0.729895 -1.311174
H  4.264962 0.964445 1.043339
H  3.130796 -1.909492 0.991479
H  4.212951 -1.205955 2.237728
H  2.221705 3.227418 -1.30607
H  4.061745 -1.617859 -1.288443
H  1.219483 -1.652586 -1.229364
H  5.958968 -1.406266 0.670883
H  -3.547236 -2.617456 -0.887288
H  -5.93339 -0.976758 -0.812673
H  -5.693607 -1.651031 0.818089
H  -5.870705 -2.760909 -0.587146
