program: Gaussian 09
title: 000273031
version: EM64L-G09RevD.01
frameworkgroup: C1[X(C25H27NO5S)]
method: RPBEPBE
basis: SDD
operation: Freq
keyword: #p
keyword: freq=noraman
keyword: PBEPBE/SDD
title: #p freq=noraman PBEPBE/SDD
converged: YES YES NO NO
title: Mulliken charges:
elementType: S O O O O O N C C C C C C C C C C C C C C C C C C C C C C C C C H H H H H H H H H H H H H H H H H H H H H H H H H H H
charge: 0.969485 -0.286456 -0.392453 -0.273330 -0.494483 -0.522852 -0.046994 0.211432 -0.159292 -0.224837 -0.213078 -0.482838 0.031467 -0.586597 -0.426882 -0.147232 0.370780 -0.221311 0.047189 -0.229542 -0.642716 -0.422801 0.157138 -0.356823 -0.022400 -0.522111 -0.236485 -0.239098 -0.358908 -0.360852 0.452473 -0.797432 0.302678 0.226236 0.271021 0.212125 0.238885 0.222935 0.229338 0.212527 0.208512 0.279116 0.218520 0.232395 0.227761 0.222322 0.186715 0.234686 0.245201 0.255023 0.213790 0.229252 0.274764 0.284716 0.245186 0.246108 0.231694 0.231445 0.244887
chargesum: 0.00000
title: Mulliken charges with hydrogens summed into heavy atoms:
elementType: S O O O O O N C C C C C C C C C C C C C C C C C C C C C C C C C
charge: 0.969485 -0.286456 -0.392453 -0.273330 -0.494483 -0.522852 -0.046994 0.211432 0.143386 0.001399 0.057944 -0.031828 0.031467 -0.134324 -0.005843 0.131883 0.370780 -0.002791 0.047189 0.002853 -0.005918 -0.188115 0.157138 -0.111621 -0.022400 0.175954 0.038279 0.045618 -0.113722 -0.114744 0.452473 -0.089406
polarizability: 4.12775344e+02 2.63677963e+01 2.94355252e+02 1.81516960e+01 1.05905007e+01 2.50847092e+02
1716.lowfreq: -52.5656 -6.8665 -0.0005 -0.0001 0.0004 2.3247 7.9196 20.0543 21.3055
frequency: -52.5284 19.5311 21.1008 27.7177 40.8720 43.6379 55.4122 63.6886 76.5300 95.7187 120.3083 126.1128 135.8476 147.5282 160.2685 167.1009 193.1487 210.2174 218.3382 224.2158 230.2002 254.1570 268.8730 289.5819 295.3064 302.2423 310.4575 324.0031 340.5119 348.2710 352.7634 373.1789 385.7381 395.3349 407.9253 412.5643 419.0255 449.0302 459.6066 471.5969 476.8698 503.2439 508.7115 522.6384 543.1904 549.9468 569.9767 587.9355 596.8789 600.4576 621.3743 649.2204 666.8919 696.4136 698.5945 705.3228 733.1648 753.9115 778.4721 785.6231 803.4523 807.4495 819.3643 825.7372 832.3246 847.0758 852.6597 875.5621 886.4409 899.6621 914.8042 930.9838 944.2889 948.1871 961.8579 966.0893 971.8195 982.0538 982.6356 991.0882 991.6789 993.6490 1025.5155 1041.0467 1049.4773 1052.7759 1054.6225 1077.8501 1085.2253 1098.8627 1111.6659 1115.4279 1117.9997 1120.1796 1128.6232 1141.7740 1155.0638 1157.7414 1169.1686 1171.1663 1185.3456 1196.6494 1209.3104 1219.0323 1220.3427 1231.8323 1233.3280 1240.2154 1250.4221 1272.6854 1282.3262 1289.5408 1297.5606 1301.5237 1307.4047 1321.2472 1333.1589 1345.9414 1354.1849 1371.0629 1382.0109 1382.7450 1392.9042 1398.7087 1400.9723 1415.8625 1431.0868 1435.7881 1444.7866 1452.8670 1457.4589 1462.9658 1470.2582 1473.0034 1473.5107 1475.3082 1479.1217 1488.7229 1493.3568 1595.1780 1596.4184 1600.6924 1638.9057 1658.3384 2854.6061 2872.8282 2959.4624 2972.4895 2976.2123 2981.5109 2986.0175 2990.2756 2990.6014 3007.6367 3008.5510 3013.3480 3052.1422 3064.3200 3067.9859 3080.0659 3093.9935 3096.0213 3096.2667 3125.7091 3126.2636 3138.0257 3139.6592 3146.4655 3161.2050 3164.6718 3167.6819
redmass: 1.0107 5.3623 5.0489 4.1808 5.0211 2.2960 4.9015 4.3155 5.7638 2.6425 3.0166 4.5867 5.8680 3.5832 2.6629 3.7334 3.7518 4.3533 3.6077 1.5346 2.8944 3.6883 2.5724 4.5851 4.7758 4.1099 3.6509 3.1798 3.8058 5.8986 5.0924 3.6453 4.7137 5.4671 2.8702 5.7949 5.9077 4.3035 4.0673 4.9813 4.8266 3.2753 4.1148 4.5802 4.2728 3.6216 3.9161 5.7534 6.2757 5.0856 6.9583 4.8577 5.8033 2.5015 4.5139 3.3086 3.7112 3.9909 4.9540 2.9675 2.3090 1.9439 5.5455 1.7467 3.5307 1.2477 2.8979 2.8397 5.3880 4.1276 4.0248 1.4702 2.0376 10.4738 1.3335 2.5598 2.3737 1.3965 1.7048 1.4744 3.3514 4.9870 2.4475 2.5772 1.5978 2.1751 2.4785 2.1699 1.9339 3.7335 1.3972 1.2711 1.5619 1.2841 2.0256 2.4062 1.4820 1.3439 1.4643 1.2547 1.1339 2.0781 1.8016 2.9676 1.4683 1.6333 1.3869 1.3837 2.6778 1.6664 1.6575 1.5611 1.2615 1.4131 1.8844 1.6532 1.5819 1.5657 1.3607 1.4281 1.6292 6.0472 3.0085 1.2180 7.4902 4.4231 1.1704 1.2305 1.1097 1.1026 1.0587 1.0671 1.1042 1.3282 1.6253 1.0639 1.0760 2.8183 1.0742 6.0998 6.8945 9.7937 8.3335 7.4620 1.0576 1.0702 1.0641 1.0803 1.0337 1.0391 1.0608 1.0842 1.0831 1.0815 1.0869 1.0866 1.1038 1.0946 1.1007 1.0994 1.1001 1.0871 1.0881 1.1038 1.0886 1.0893 1.0896 1.0962 1.0945 1.0955 1.0968
irintensity: 0.5608 1.1134 0.9926 0.1467 2.0316 3.0996 0.2500 0.5786 1.1363 2.0851 2.5194 2.5109 1.3936 0.8308 3.5630 0.9112 2.0244 1.6754 1.3984 6.8549 11.0935 2.2315 1.1345 4.8754 0.8450 1.3116 4.4187 4.9814 3.5983 2.4905 1.3889 3.0663 6.9874 11.9720 0.0517 12.2679 22.8353 14.5423 3.3648 12.8020 57.3119 11.2937 6.9371 150.7950 0.9710 20.7892 2.9429 18.5154 53.8522 6.4585 0.2329 13.1804 14.2548 4.0234 1.0495 0.9008 5.1572 2.7891 1.5616 20.4295 44.0325 50.6114 93.0704 17.1009 44.5745 0.9401 71.1619 31.6504 9.6431 34.6164 51.6839 7.6575 10.7985 74.5267 0.3082 18.6297 29.1539 0.6969 9.2530 3.0676 23.9216 2.2598 73.4410 13.3391 23.6948 9.4230 34.1448 13.9848 24.7915 15.4262 8.3749 1.7346 9.9716 7.3305 1.4136 27.6645 18.2637 3.1923 16.7643 12.8770 17.3525 19.5668 4.5392 9.5606 0.4704 35.0040 20.0702 10.2532 73.2518 13.7336 7.6458 7.2914 2.3784 5.9881 9.8440 2.9264 2.5981 11.3401 11.2455 12.2788 4.6133 0.3983 10.3947 17.0546 22.9456 26.4936 5.7156 5.3374 31.7849 11.0655 7.6428 21.2321 16.9745 15.9586 22.9222 49.8090 3.9103 76.7082 9.6744 12.7387 0.8737 32.8155 17.8573 22.6791 100.2382 108.8580 19.1802 8.1453 72.3700 24.3813 19.6707 53.8585 22.0669 64.8976 23.6157 53.2444 28.0295 17.6354 30.6311 32.1300 14.1291 11.3801 15.8725 26.5819 13.0530 11.7494 8.8589 15.4606 13.8772 0.7593 10.3443
temp: 298.150 k
press: 1.00000 atm
elementType: 16 8 8 8 8 8 7 6 6 6 6 6 6 6 6 6 6 6 6 6 6 6 6 6 6 6 6 6 6 6 6 6 1 1 1 1 1 1 1 1 1 1 1 1 1 1 1 1 1 1 1 1 1 1 1 1 1 1 1
symmnumber: 1
zpe: 1226098.5 jmol-1
zpe.correction: 0.466996 hartree
zpe.thermalcorrener: 0.495792 hartree
zpe.thermalcorrenthalpy: 0.496736 hartree
zpe.thermalcorrgfe: 0.406731 hartree
zpe.sumelectzpe: -1795.232157 hartree
zpe.sumelectthermal: -1795.203362 hartree
zpe.sumelectthermalent: -1795.202417 hartree
zpe.sumelectthermalfe: -1795.292422 hartree
dipole: 3.6558 0.7447 2.3218
dipole: 4.3943
quadrupole: -150.5544 -201.9437 -188.6181
quadrupole: 22.8522 7.4940 4.9248
quadrupole: 29.8177 -21.5716 -8.2460 22.8522 7.4940 4.9248
hfenergy: -1795.6991531 hartree
pointgroup: C01 [X(C25H27N1O5S1)]
dipole: 1.4059108 -0.1258665 0.998266 debye
polarizability: 413.2782144|8.6590498|281.1942489|31.4328912|19.9557811|263.5052249 unknown
InChI: InChI=1S/C25H27NO5S/c1-15-4-7-17(8-5-15)32(27,28)31-21-11-9-18-19-14-16-6-10-20(29-3)23-22(16)25(18,24(21)30-23)12-13-26(19)2/h4-11,18-19,21,24H,12-14H2,1-3H3
charge 0 multiplicity 1
59 atoms
S  2.5250 -1.05751 -1.038246
O  -0.953349 1.679318 0.979586
O  1.871328 0.68923 -0.825369
O  -2.981903 4.061377 1.059346
O  2.781218 -1.393677 -2.600899
O  1.632532 -2.057782 -0.113934
N  -3.137218 -2.979102 0.037955
C  -1.548689 -0.546667 0.177585
C  -1.514633 -1.490794 -1.047816
C  -2.93419 -2.128536 -1.172386
C  -0.344791 0.419591 0.358944
C  -1.776624 -1.42227 1.445475
C  -2.680653 0.452227 -0.004959
C  -4.064766 -1.069593 -1.442941
C  -3.075826 -2.243759 1.325905
C  0.378077 0.851923 -0.949267
C  -3.885163 0.238082 -0.681972
C  -1.00938 -0.790466 -2.283798
C  -2.312335 1.688574 0.54608
C  -0.137055 0.250289 -2.236322
C  -4.295467 -3.883775 -0.042582
C  -4.799226 1.327312 -0.701922
C  -3.220968 2.769553 0.562715
C  -4.478709 2.548443 -0.067932
C  4.174594 -0.730692 -0.211871
C  -2.02944 4.188488 2.178874
C  4.263338 -0.870093 1.181781
C  5.258108 -0.37503 -1.029534
C  5.518921 -0.635658 1.78252
C  6.501628 -0.144998 -0.401756
C  6.650567 -0.269578 1.005162
C  7.999683 -0.046651 1.662371
H  -0.823778 -2.332001 -0.830138
H  -2.92257 -2.824741 -2.035347
H  0.391297 0.063143 1.09444
H  -1.829383 -0.783474 2.347708
H  -0.91115 -2.104377 1.550108
H  -5.049563 -1.528362 -1.223757
H  -4.077071 -0.842946 -2.529551
H  -3.113257 -2.990383 2.142371
H  -3.957233 -1.569467 1.463525
H  0.338193 1.959262 -0.999391
H  -1.308491 -1.195967 -3.260957
H  0.265572 0.685417 -3.158133
H  -4.242805 -4.620073 0.780655
H  -4.269166 -4.438701 -0.998038
H  -5.288319 -3.372077 0.031242
H  -5.761164 1.229905 -1.218851
H  -5.18412 3.385848 -0.074813
H  -1.0272 3.822971 1.899485
H  -2.392393 3.626934 3.061144
H  -1.999546 5.265148 2.404884
H  3.390466 -1.165966 1.771996
H  5.134061 -0.293176 -2.113795
H  5.619453 -0.735923 2.869131
H  7.365509 0.137303 -1.013972
H  8.615533 0.670256 1.092611
H  7.89187 0.334794 2.692417
H  8.568448 -0.994823 1.721031
