program: Gaussian 09
title: 000273015
version: EM64L-G09RevD.01
frameworkgroup: C1[X(C18H21N5O8)]
method: RPBEPBE
basis: SDD
operation: Freq
keyword: #p
keyword: freq=noraman
keyword: PBEPBE/SDD
title: #p freq=noraman PBEPBE/SDD
converged: YES YES NO NO
title: Mulliken charges:
elementType: O O O O O O O O N N N N N C C C C C C C C C C C C C C C C C C H H H H H H H H H H H H H H H H H H H H H
charge: -0.300052 -0.282358 -0.282710 -0.266264 -0.219744 -0.254025 -0.268713 -0.178131 -0.397021 -0.064590 -0.014537 0.021001 -0.405077 -0.135334 -0.148922 -0.191914 -0.024906 0.357330 -0.350838 -0.093647 -0.113564 0.296241 0.350876 0.175969 -0.756870 0.329382 -0.773757 -0.402053 -0.757291 0.221061 -0.798280 0.345296 0.330581 0.280815 0.246538 0.259841 0.241602 0.359298 0.257502 0.251346 0.248900 0.250104 0.247602 0.284978 0.252012 0.350732 0.282214 0.243468 0.246049 0.240084 0.240567 0.269205
chargesum: 0.00000
title: Mulliken charges with hydrogens summed into heavy atoms:
elementType: O O O O O O O O N N N N N C C C C C C C C C C C C C C C C C C
charge: -0.300052 -0.282358 -0.282710 -0.266264 -0.219744 -0.254025 -0.268713 -0.178131 -0.037723 -0.064590 -0.014537 0.021001 -0.054345 0.209962 0.181659 0.088901 0.221633 0.357330 0.150606 -0.093647 -0.113564 0.296241 0.350876 0.175969 0.000878 0.329382 0.008927 -0.150041 0.014440 0.221061 -0.048423
polarizability: 3.27547527e+02 -3.05575837e+01 2.51274711e+02 1.95828519e+01 1.12422907e+01 2.04461594e+02
1716.lowfreq: -5.0262 -4.3644 0.0008 0.0010 0.0014 7.2975 8.9377 17.7343 19.3130
frequency: 8.3678 17.4765 19.3015 26.2739 32.1788 34.2077 41.1980 49.2250 54.2150 60.7679 63.7435 75.2394 80.8175 89.6334 94.6619 101.5110 105.8436 111.9754 124.6217 135.5573 171.6084 177.6427 185.7530 199.2853 203.5604 231.6505 251.8379 276.8842 287.3639 296.5124 302.3516 315.4166 319.0999 345.0004 380.5518 400.8850 463.2816 476.9792 513.5365 527.6409 537.1667 556.5888 561.6824 565.8722 568.8680 578.6235 598.2264 606.9805 620.1681 623.4633 632.9487 651.6120 668.1591 690.9202 721.1272 750.9291 759.9772 769.3654 772.5330 793.4328 810.7791 830.3185 841.9439 852.2981 869.8019 881.5519 893.1932 935.4684 938.2752 956.2426 959.2850 968.9346 972.5148 996.2687 999.6018 1006.4347 1016.0256 1032.1397 1033.4076 1043.3478 1045.9392 1049.5307 1058.4218 1077.7326 1084.0000 1138.8362 1142.8803 1168.7119 1175.1664 1182.7814 1185.2220 1199.9649 1209.1067 1213.8098 1250.8456 1267.2888 1273.7868 1277.7268 1283.1598 1290.8262 1321.2387 1344.6054 1351.5545 1355.3528 1363.0791 1368.7352 1375.3833 1380.5595 1382.5006 1385.5016 1386.3348 1438.7528 1449.3216 1452.3911 1452.4915 1453.8882 1454.3545 1456.3857 1458.4579 1467.6223 1470.5525 1477.5587 1502.1366 1541.0027 1591.5696 1651.7670 1659.9226 1668.7877 1669.6858 2987.7004 3003.6858 3004.3245 3007.7144 3008.5709 3015.5606 3038.9551 3073.2041 3081.2964 3087.0960 3100.5892 3101.1490 3101.7279 3112.9126 3137.8049 3142.3333 3142.5674 3142.7286 3169.0545 3492.9046 3581.9895
redmass: 6.9474 1.0843 4.9856 5.5614 3.4994 2.9608 3.5132 3.6312 3.9441 2.9930 4.0358 4.8247 5.1822 9.5993 2.9829 1.1337 2.7816 1.1719 5.4512 5.5992 5.7441 7.2034 6.3912 8.7521 8.9507 8.6027 8.0464 4.4239 5.6265 3.9065 4.1899 4.7378 4.3715 5.0884 5.0112 3.4287 3.9763 4.1143 5.2300 6.3952 3.5236 3.2986 3.5186 3.4096 3.4183 3.4363 6.4135 6.4160 5.4969 8.0694 5.4890 6.2613 5.1987 4.6523 1.3229 3.8984 6.5737 5.0854 1.4169 5.1226 8.0597 4.0592 4.8892 5.1499 5.2055 7.7593 5.0983 1.5549 3.2344 3.9538 4.4292 3.0828 2.3327 2.3903 2.2677 2.0930 3.4437 1.6982 3.2302 1.6664 1.6537 1.6454 2.1719 3.3207 3.0659 6.4394 2.1002 3.1885 3.5084 2.9256 2.0025 2.6779 3.3650 1.3284 1.2818 1.2970 1.6348 1.4183 2.3045 2.1245 1.5174 1.3763 1.4654 3.5230 1.7047 1.9816 1.2294 2.5796 1.2757 1.2283 1.2458 1.8814 1.7747 1.0588 1.0553 1.0555 1.0535 1.0566 1.0560 1.0468 2.1853 1.0830 6.5836 3.5094 5.8372 9.7739 10.1024 9.8278 6.1109 1.0382 1.0389 1.0388 1.0383 1.0847 1.0849 1.0566 1.0982 1.0858 1.0890 1.0943 1.0930 1.0932 1.1084 1.0983 1.1023 1.1028 1.1027 1.0921 1.0769 1.0819
irintensity: 1.4019 0.6280 3.5950 1.5718 1.6676 1.6254 0.0019 0.5180 4.3349 1.8923 2.7616 2.7347 4.2726 0.9768 4.4824 1.4063 5.0177 1.1983 0.6365 1.4597 1.5620 2.2681 1.2862 3.7719 2.0987 3.8608 1.8947 0.0712 10.7002 15.1913 8.3632 6.6962 3.5467 2.7382 22.4926 6.4108 8.6623 4.0934 30.6756 2.5665 4.2149 10.7574 8.3456 2.8791 7.4823 2.0846 3.3749 12.1651 2.2074 3.8950 19.8117 15.1267 7.1395 10.0284 61.0542 20.0780 6.8446 12.9946 104.3040 12.1462 1.0695 11.4090 24.6863 21.3687 36.6525 30.9104 29.8291 0.2420 92.8433 46.8023 25.4226 14.4784 45.2347 146.3014 67.9095 118.9086 110.0531 10.7072 28.4801 11.9469 14.4083 12.0157 35.0536 10.3824 31.1872 48.4014 21.5923 22.8595 182.7507 247.6858 149.4321 306.8771 155.8830 98.5593 21.2437 5.9642 8.8247 17.1257 5.3329 22.6086 28.1713 4.0114 7.4789 149.4935 4.0255 17.0051 66.5700 4.7089 65.7047 107.9139 11.5647 302.3212 18.2751 23.2496 32.3520 4.3786 13.8402 25.7206 7.0441 20.3224 151.3557 18.5710 203.9675 481.4002 61.5212 111.5205 152.7850 176.0594 166.1745 5.5811 1.7403 0.5079 0.8639 25.6029 10.0807 21.0147 13.1942 13.3374 2.1294 6.3141 9.4257 2.7058 10.9874 9.4238 6.2819 4.3337 8.7349 13.9114 26.1855 138.5468
temp: 298.150 k
press: 1.00000 atm
elementType: 8 8 8 8 8 8 8 8 7 7 7 7 7 6 6 6 6 6 6 6 6 6 6 6 6 6 6 6 6 6 6 1 1 1 1 1 1 1 1 1 1 1 1 1 1 1 1 1 1 1 1 1
symmnumber: 1
zpe: 1022575.3 jmol-1
zpe.correction: 0.389478 hartree
zpe.thermalcorrener: 0.421018 hartree
zpe.thermalcorrenthalpy: 0.421963 hartree
zpe.thermalcorrgfe: 0.319515 hartree
zpe.sumelectzpe: -1571.771638 hartree
zpe.sumelectthermal: -1571.740098 hartree
zpe.sumelectthermalent: -1571.739154 hartree
zpe.sumelectthermalfe: -1571.841601 hartree
dipole: -4.4299 -1.8990 -5.0477
dipole: 6.9792
quadrupole: -187.5124 -165.8541 -184.9976
quadrupole: -23.9726 -10.0009 -6.4908
quadrupole: -8.0577 13.6006 -5.5429 -23.9726 -10.0009 -6.4908
hfenergy: -1572.1611162 hartree
pointgroup: C01 [X(C18H21N5O8)]
dipole: -1.8027796 0.5404472 1.9993642 debye
polarizability: 311.6018694|41.1487698|266.5792412|-27.3866862|1.4740373|205.1027213 unknown
InChI: InChI=1S/C18H21N5O8/c1-7(24)21-18-14-12(19-6-20-18)13(22-23-14)16-17(30-10(4)27)15(29-9(3)26)11(31-16)5-28-8(2)25/h6,11,15-17,21-22H,5H2,1-4H3
charge 0 multiplicity 1
52 atoms
O  -1.358424 -0.333142 2.187595
O  -1.597293 -3.092183 0.678444
O  -1.669067 0.33498 -0.776806
O  -4.604756 0.948073 0.886833
O  -1.797093 -3.700562 -1.566958
O  -3.437527 0.193287 -2.301146
O  -4.112674 2.86209 -0.362868
O  6.588153 1.547877 -1.625896
N  1.004758 0.943529 1.654362
N  2.156958 1.602257 1.249007
N  2.333115 -1.620097 -0.472588
N  4.336794 -0.313806 -1.089554
N  4.721995 1.910865 -0.217142
C  -1.054159 -1.77744 0.248287
C  -2.227806 -0.806401 -0.015949
C  -0.349345 -1.180433 1.487846
C  -2.630593 -0.36504 1.404921
C  0.830864 -0.318446 1.134448
C  -3.273204 1.017069 1.542333
C  1.965101 -0.540908 0.315335
C  2.742803 0.667787 0.422944
C  -1.903184 -4.002624 -0.36215
C  -2.380333 0.746149 -1.933705
C  3.970411 0.735685 -0.326351
C  -2.32445 -5.332499 0.215249
C  -4.892511 1.922213 -0.090335
C  -1.705191 1.93167 -2.569529
C  3.501143 -1.42493 -1.122062
C  -6.212348 1.62742 -0.755257
C  5.948612 2.277415 -0.834981
C  6.402362 3.679757 -0.421433
H  -0.398905 -1.906346 -0.627821
H  -3.052028 -1.261361 -0.588843
H  -0.056566 -1.998164 2.172448
H  -3.288843 -1.142972 1.838653
H  -2.660787 1.801829 1.068708
H  -3.442776 1.251781 2.606001
H  0.334599 1.410508 2.267034
H  -1.423552 -5.928377 0.450454
H  -2.922737 -5.885131 -0.524124
H  -2.890915 -5.197113 1.149825
H  -0.625472 1.938908 -2.358799
H  -1.88959 1.928225 -3.654597
H  -2.156299 2.84695 -2.142706
H  3.851102 -2.237762 -1.76522
H  4.301215 2.607276 0.408118
H  -6.012953 0.981119 -1.630534
H  -6.670147 2.562589 -1.111537
H  -6.893747 1.093291 -0.076226
H  6.546282 3.748221 0.672969
H  5.659104 4.443487 -0.717352
H  7.356503 3.90123 -0.920142
