program: Gaussian 09
title: 000272914
version: EM64L-G09RevD.01
frameworkgroup: C1[X(C20H18N2O5)]
method: RPBEPBE
basis: SDD
operation: Freq
keyword: #p
keyword: freq=noraman
keyword: PBEPBE/SDD
title: #p freq=noraman PBEPBE/SDD
converged: YES YES NO NO
title: Mulliken charges:
elementType: O O O O O N N C C C C C C C C C C C C C C C C C C C C H H H H H H H H H H H H H H H H H H
charge: -0.195621 -0.198447 -0.191164 -0.296167 -0.275013 -0.230226 -0.428085 -0.483201 0.182782 0.189105 0.103835 0.122735 0.223539 -0.460414 -0.349797 -0.350539 -0.209160 -0.209104 0.479567 -0.353804 -0.420045 0.233502 -0.367154 -0.319526 0.178363 -0.257318 -0.666734 0.264685 0.284635 0.247255 0.259844 0.271244 0.271209 0.336242 0.241581 0.241527 0.234364 0.225587 0.264726 0.267485 0.217030 0.232859 0.251059 0.224123 0.212636
chargesum: 0.00000
title: Mulliken charges with hydrogens summed into heavy atoms:
elementType: O O O O O N N C C C C C C C C C C C C C C C C C C C C
charge: -0.195621 -0.198447 -0.191164 -0.296167 -0.275013 -0.230226 -0.091843 0.066119 0.182782 0.189105 0.103835 0.122735 0.223539 0.046685 -0.078553 -0.079330 0.032422 0.032423 0.479567 -0.119440 -0.194459 0.233502 -0.102428 -0.052041 0.178363 0.192571 0.021084
polarizability: 4.24216279e+02 -5.19627469e+00 1.95685933e+02 3.09418418e+01 -1.60060651e+00 1.81825204e+02
1716.lowfreq: -5.0254 -0.0009 -0.0006 0.0012 2.8889 5.1917 9.8559 18.5778 19.7136
frequency: 9.5079 18.5521 19.5599 30.8141 44.7301 59.6517 60.5146 73.6916 92.4539 108.1032 123.5588 128.5730 140.0204 170.6801 175.7798 186.2634 213.8452 226.0387 240.7130 262.5331 287.6373 316.1602 321.4887 339.0148 342.3246 400.8515 413.8733 417.6895 446.4351 455.5927 456.7187 496.8068 508.7516 522.8693 529.4798 571.4694 585.8559 621.6463 632.6291 658.9148 672.1325 677.2191 685.8100 704.0019 728.3428 741.9766 755.0677 787.2658 795.7048 797.5585 813.0322 822.3176 830.7452 841.1072 844.8425 873.2512 907.7562 908.5180 964.0013 975.8397 975.9816 982.1233 985.5576 991.7840 1007.8551 1009.6228 1018.5208 1056.1399 1072.3470 1076.7354 1094.7461 1096.5194 1119.0869 1153.4505 1169.5010 1170.9563 1172.9172 1185.3854 1205.0617 1210.9670 1258.3162 1279.4814 1279.9615 1285.3411 1300.2278 1310.3266 1335.0522 1356.5109 1359.3584 1366.2662 1379.4396 1387.7188 1415.7654 1423.4159 1439.2784 1453.7550 1454.8793 1455.5374 1457.2595 1461.4792 1479.3075 1484.6576 1533.6913 1569.5632 1612.5797 1613.7751 1620.1324 1633.1662 1634.7524 1650.9776 1683.0722 2906.0855 2937.3104 2989.1824 2990.5747 3025.6835 3055.0364 3084.7307 3089.7148 3115.6269 3125.6175 3139.5246 3141.8369 3155.0265 3160.8463 3166.4886 3175.0770 3176.2724 3509.0608
redmass: 6.5855 5.7041 4.6478 5.7494 3.7894 5.0534 4.3746 7.3296 5.4233 8.9256 4.6510 3.8416 5.1012 3.1051 7.3518 3.9963 1.9437 2.3823 5.1424 2.8189 4.8174 6.3609 3.5989 8.6025 6.7554 4.9368 3.1902 2.9863 2.4006 4.7306 3.5722 5.5745 2.6872 6.6876 5.2416 1.1596 9.3747 6.7546 7.0534 4.8190 5.3068 4.0771 5.6840 4.2464 3.3554 3.0865 4.5633 5.0130 2.1285 1.9810 1.4156 1.3692 3.5049 1.8443 3.6211 3.5654 1.5095 2.9940 6.0615 1.3667 1.4139 1.9557 1.6710 3.5075 1.3520 2.5768 2.0414 4.9720 2.6227 3.4476 2.1409 2.6753 1.4458 1.6672 2.1237 1.2513 2.0018 1.2222 1.1569 3.1940 2.8889 1.5569 1.1402 1.4770 1.3829 1.3799 1.6118 1.4629 1.6361 5.7656 4.1392 1.2407 3.4390 1.3049 3.3063 1.1942 2.4788 2.5113 1.2572 1.0462 1.5883 1.0534 3.5673 5.6680 8.9164 7.6229 7.7548 6.9868 11.3072 7.8616 11.9055 1.0595 1.0965 1.0600 1.0361 1.0588 1.1000 1.0981 1.1031 1.1052 1.0898 1.0871 1.0866 1.0907 1.0962 1.0957 1.0948 1.1005 1.0764
irintensity: 0.1370 0.1905 0.3906 0.0871 0.5312 5.0943 2.6033 2.2206 1.6436 2.4009 1.9391 1.5799 0.0488 7.6508 1.4396 10.1309 0.8937 0.5340 0.1030 2.2932 0.4370 5.7975 13.6360 20.4873 22.4991 15.1831 2.8570 0.2254 2.8932 1.3188 12.8600 11.8961 15.3789 6.7579 8.1402 77.0200 7.9548 17.6895 3.2785 0.0078 1.5374 26.3759 3.0960 31.9922 23.6207 46.9827 13.9950 0.0465 13.2958 14.7197 1.0725 0.0221 0.1850 63.9378 6.2321 21.6745 1.5204 9.8935 3.6310 0.0855 1.9903 21.2979 20.4018 11.0418 0.0029 15.3207 12.5863 555.2955 26.7676 100.4765 29.9533 19.3035 10.8657 72.1131 68.3651 1.5645 7.0437 131.1351 14.1486 48.2559 392.4711 4.5128 1.7532 0.9717 19.1780 4.7674 52.0338 15.1124 97.9280 404.2218 64.3682 22.3444 4.6083 60.3544 7.2223 83.7329 12.7804 4.7011 13.5967 14.1017 67.5868 22.7627 284.0225 61.7371 417.0667 0.8687 50.6414 478.6599 313.8364 61.7605 48.6928 133.0580 20.2819 39.2960 26.5057 45.5167 4.3078 42.3088 5.7576 33.8994 14.2431 15.0038 1.5895 4.8123 15.6993 4.7411 2.8365 20.5718 193.4803
temp: 298.150 k
press: 1.00000 atm
elementType: 8 8 8 8 8 7 7 6 6 6 6 6 6 6 6 6 6 6 6 6 6 6 6 6 6 6 6 1 1 1 1 1 1 1 1 1 1 1 1 1 1 1 1 1 1
symmnumber: 1
zpe: 900263.4 jmol-1
zpe.correction: 0.342892 hartree
zpe.thermalcorrener: 0.367547 hartree
zpe.thermalcorrenthalpy: 0.368491 hartree
zpe.thermalcorrgfe: 0.283848 hartree
zpe.sumelectzpe: -1256.673778 hartree
zpe.sumelectthermal: -1256.649123 hartree
zpe.sumelectthermalent: -1256.648179 hartree
zpe.sumelectthermalfe: -1256.732822 hartree
dipole: -6.1615 1.0476 -0.3595
dipole: 6.2602
quadrupole: -122.7817 -159.1091 -158.0904
quadrupole: -3.8559 -11.7543 -6.9825
quadrupole: 23.8787 -12.4487 -11.4300 -3.8559 -11.7543 -6.9825
hfenergy: -1257.0166699 hartree
pointgroup: C01 [X(C20H18N2O5)]
dipole: 2.4384092 0.2078234 0.2777077 debye
polarizability: 424.7574766|-18.2045851|191.037844|22.9113581|6.6697792|185.9320951 unknown
InChI: InChI=1S/C20H18N2O5/c1-2-27-20(26)13-7-9-14(10-8-13)21-11-15(23)12-22-18(24)16-5-3-4-6-17(16)19(22)25/h3-10,21H,2,11-12H2,1H3
charge 0 multiplicity 1
45 atoms
O  4.520897 -2.675949 -0.84182
O  3.300968 1.858738 -0.583268
O  1.485917 -0.780374 0.967004
O  -7.492136 -0.088648 1.113866
O  -7.421276 0.242153 -1.200459
N  3.620828 -0.476473 -0.855139
N  -1.140614 -0.544898 0.353799
C  2.293509 -0.795839 -1.348176
C  5.778406 -0.681916 -0.015394
C  5.412765 0.686041 0.059879
C  4.633217 -1.451234 -0.595379
C  4.02035 0.836672 -0.466788
C  1.21788 -0.682001 -0.254244
C  -0.21076 -0.467473 -0.751317
C  7.037638 -1.127533 0.412428
C  6.295437 1.651978 0.564711
C  7.937445 -0.157355 0.925988
C  7.57207 1.210708 1.000836
C  -2.516397 -0.3983 0.232422
C  -3.141444 -0.172427 -1.033139
C  -3.341108 -0.478408 1.398598
C  -5.352778 -0.117908 0.039779
C  -4.535739 -0.036078 -1.118137
C  -4.731373 -0.340451 1.301029
C  -6.816748 0.034192 -0.114269
C  -8.973086 0.075985 1.06758
C  -9.360717 1.553651 1.184653
H  2.028955 -0.148174 -2.203904
H  2.320147 -1.846483 -1.702087
H  -0.428033 -1.221513 -1.542059
H  -0.236639 0.524417 -1.260811
H  7.308265 -2.186117 0.351183
H  6.002837 2.705073 0.619393
H  -0.713379 -0.661633 1.277324
H  8.929106 -0.467725 1.271707
H  8.287293 1.935984 1.403014
H  -2.538811 -0.101419 -1.944384
H  -2.873517 -0.650997 2.375621
H  -5.021398 0.138018 -2.08436
H  -5.356696 -0.40348 2.195856
H  -9.329513 -0.513547 1.928118
H  -9.347593 -0.359608 0.124418
H  -9.002684 2.119684 0.30855
H  -8.933906 2.001619 2.098865
H  -10.461682 1.649951 1.232812
