program: Gaussian 09
title: 000272913
version: EM64L-G09RevD.01
frameworkgroup: C1[X(C20H19N3O5)]
method: RPBEPBE
basis: SDD
operation: Freq
keyword: #p
keyword: freq=noraman
keyword: PBEPBE/SDD
title: #p freq=noraman PBEPBE/SDD
converged: YES YES NO NO
title: Mulliken charges:
elementType: O O O O O N N N C C C C C C C C C C C C C C C C C C C C H H H H H H H H H H H H H H H H H H H
charge: -0.181520 -0.230151 -0.442496 -0.296546 -0.271407 -0.223705 -0.151225 -0.048197 -0.453694 -0.590602 0.243514 0.181674 0.179804 0.092851 0.119439 0.424244 -0.348963 -0.351527 -0.687171 -0.208956 -0.208842 -0.363518 -0.339755 -0.374314 -0.363967 0.244651 0.161788 -0.501904 0.273096 0.261182 0.270925 0.299505 0.271963 0.270140 0.224935 0.235871 0.281032 0.241678 0.241313 0.242959 0.266307 0.263351 0.264539 0.379197 0.238422 0.225914 0.238167
chargesum: 0.00000
title: Mulliken charges with hydrogens summed into heavy atoms:
elementType: O O O O O N N N C C C C C C C C C C C C C C C C C C C C
charge: -0.181520 -0.230151 -0.063299 -0.296546 -0.271407 -0.223705 -0.151225 -0.048197 0.080584 -0.020172 0.243514 0.181674 0.179804 0.092851 0.119439 0.424244 -0.077000 -0.081386 0.054667 0.032722 0.032471 -0.120559 -0.073448 -0.110963 -0.099428 0.244651 0.161788 0.200599
polarizability: 4.21808715e+02 -2.54395084e+01 2.47022316e+02 -2.01404444e+01 1.12440638e+00 1.62724211e+02
1716.lowfreq: -5.2701 -2.0329 -0.0006 -0.0005 0.0008 5.2747 9.0889 25.3874 28.1461
frequency: 8.8628 25.3766 28.1232 38.0248 48.6618 60.4902 68.8185 81.3838 101.4861 109.5402 112.4633 127.1176 140.1022 140.9903 173.8739 182.5018 213.5117 223.6338 237.9384 245.9718 256.2446 267.1312 288.6520 307.8333 311.5797 330.7800 343.3020 369.8748 410.9047 420.6029 425.4566 446.8673 455.5145 462.3412 493.0613 511.1387 518.7387 524.0352 555.3715 586.3423 610.5828 631.3259 651.7356 658.9633 679.9153 681.9226 698.0848 720.8158 733.8198 756.7315 769.6648 785.1497 791.0118 797.8492 824.5195 826.6326 844.5608 881.3209 907.5620 923.6456 930.7973 947.5154 958.1283 975.7424 977.6567 984.7407 993.0939 999.2374 1007.7999 1015.2669 1065.4911 1065.7995 1076.0483 1113.1271 1113.3987 1120.3775 1135.1405 1145.6535 1168.3885 1171.6558 1198.1455 1200.5708 1207.1855 1217.9402 1254.9288 1271.0565 1283.4309 1291.6586 1306.4132 1319.2565 1323.9064 1357.9855 1369.8226 1373.3671 1384.7114 1417.2392 1423.4308 1441.1151 1447.5956 1450.2802 1453.4696 1454.0873 1456.4633 1465.6826 1477.9459 1481.9395 1506.5214 1525.7690 1557.6283 1605.3431 1615.3067 1615.9320 1617.5386 1625.6332 1629.4233 1679.1306 2950.5335 2998.3466 3018.3690 3022.6909 3033.5055 3080.2069 3097.1651 3097.7360 3115.0312 3139.3486 3141.9779 3147.0737 3153.4148 3155.0271 3166.3544 3171.7437 3176.2559 3176.3654 3569.3389
redmass: 6.7074 6.1346 5.9235 6.0731 5.7483 5.7123 4.4366 3.0059 1.3461 6.1109 3.4236 5.1736 5.2052 4.0265 8.0532 3.6703 2.0248 2.3589 5.5383 6.6134 3.3140 4.5525 5.0630 4.2127 6.6175 3.5319 7.3700 2.5348 3.1210 2.9698 3.0719 2.9283 4.8499 2.2661 2.1736 3.5784 3.8517 7.1107 5.1246 8.3713 4.4056 6.9869 5.5372 4.8232 5.2418 5.0486 5.0894 3.4246 4.8394 4.6157 5.3347 5.3511 3.4932 1.9471 1.3219 4.0202 1.6907 5.9969 1.3916 6.0404 3.8138 5.6286 3.5571 1.4125 1.3557 1.3483 2.4727 3.0173 1.3496 2.0360 3.5419 2.9855 2.7311 1.3077 1.2633 1.9385 1.3900 1.4584 1.2353 1.9964 1.6421 1.8147 2.6477 1.7077 1.9439 2.8983 1.4745 1.3663 1.8507 1.4143 2.4564 1.5851 1.8195 1.8092 3.5536 6.1519 1.1896 2.0668 1.2688 1.0504 1.5673 2.3528 2.0289 1.0529 1.1443 1.0578 1.2006 2.2550 6.9919 6.3818 8.6191 8.2562 8.1844 9.4542 6.8248 11.9353 1.0385 1.0296 1.0997 1.0595 1.0582 1.1031 1.1041 1.1043 1.0964 1.1044 1.0866 1.0883 1.0878 1.0907 1.0957 1.0945 1.0963 1.1004 1.0676
irintensity: 0.1638 0.2096 0.2216 0.1178 3.2783 0.8839 0.7683 0.6716 0.9958 2.8154 1.4153 4.1010 0.3149 2.6525 0.6938 2.6489 0.7318 3.5583 5.2269 0.5020 2.1791 4.3046 4.7007 12.0433 25.7689 23.1113 0.5891 21.7018 4.4926 19.3347 12.7989 4.5127 0.0911 36.8636 74.2357 20.4655 14.2052 10.1425 16.6151 33.0243 10.8612 1.1104 3.0729 0.0165 10.0324 20.1086 17.1688 51.9219 10.5724 16.1304 42.7997 0.0049 19.6211 17.1818 6.3074 27.8531 52.9313 68.0640 0.0122 4.5865 56.0820 4.7417 65.7100 2.0319 2.5200 0.6598 39.6617 25.1501 0.0010 0.8943 196.0945 113.6358 5.3955 3.6786 0.1479 41.4481 13.9923 90.6352 6.9082 8.0868 124.1336 98.6828 65.4860 20.6697 78.7571 281.8694 3.4206 13.3933 112.1375 36.0887 273.7879 16.5085 206.9831 25.7912 22.2598 13.1410 63.5552 4.8407 20.9429 12.3352 17.0389 12.0300 12.6391 13.9418 33.5204 35.4163 8.4254 205.0006 9.3987 7.5575 390.1928 155.1363 105.6802 235.3456 301.1476 68.7536 71.9573 60.7633 35.4832 14.4657 11.1479 2.3549 31.0594 2.9854 1.2070 19.2032 1.5496 1.5086 1.0934 4.8013 4.9238 14.0348 1.8948 22.2361 58.7457
temp: 298.150 k
press: 1.00000 atm
elementType: 8 8 8 8 8 7 7 7 6 6 6 6 6 6 6 6 6 6 6 6 6 6 6 6 6 6 6 6 1 1 1 1 1 1 1 1 1 1 1 1 1 1 1 1 1 1 1
symmnumber: 1
zpe: 942142.1 jmol-1
zpe.correction: 0.358843 hartree
zpe.thermalcorrener: 0.384843 hartree
zpe.thermalcorrenthalpy: 0.385787 hartree
zpe.thermalcorrgfe: 0.299790 hartree
zpe.sumelectzpe: -1311.874481 hartree
zpe.sumelectthermal: -1311.848482 hartree
zpe.sumelectthermalent: -1311.847537 hartree
zpe.sumelectthermalfe: -1311.933534 hartree
dipole: -7.6885 0.0241 1.8209
dipole: 7.9013
quadrupole: -139.5776 -156.6066 -164.3498
quadrupole: -16.8498 7.9522 -6.4405
quadrupole: 13.9337 -3.0952 -10.8385 -16.8498 7.9522 -6.4405
hfenergy: -1312.2333242 hartree
pointgroup: C01 [X(C20H19N3O5)]
dipole: -3.0152843 0.61354 -0.4415729 debye
polarizability: 420.1366115|-5.4210276|183.0262314|36.8046419|35.9550145|228.3923989 unknown
InChI: InChI=1S/C20H19N3O5/c1-22(15-9-7-13(8-10-15)20(26)28-2)11-14(21-27)12-23-18(24)16-5-3-4-6-17(16)19(23)25/h3-10,27H,11-12H2,1-2H3
charge 0 multiplicity 1
47 atoms
O  -3.11601 -0.011448 2.757869
O  -2.646402 -0.520164 -1.902209
O  0.285466 3.192719 0.315808
O  6.772336 0.647019 1.385229
O  7.234381 -1.39944 0.364415
N  -2.529475 -0.243505 0.458028
N  1.093572 -0.204632 -1.54666
N  -0.368885 2.017354 0.910934
C  -1.064808 -0.248331 0.637277
C  0.234418 0.971794 -1.323092
C  -0.381349 0.999545 0.079481
C  -4.811384 -0.141799 0.937051
C  -4.666812 -0.305001 -0.46226
C  -3.447644 -0.109561 1.5544
C  -3.206208 -0.373805 -0.783294
C  2.391094 -0.246071 -1.02085
C  -6.075698 -0.047434 1.536513
C  -5.78158 -0.379493 -1.31017
C  0.617339 -1.275824 -2.440298
C  -7.211034 -0.119321 0.687089
C  -7.066322 -0.283284 -0.713884
C  3.261542 -1.348132 -1.308286
C  2.894849 0.805868 -0.185328
C  4.559226 -1.394207 -0.780239
C  4.196253 0.746433 0.333283
C  5.051229 -0.352716 0.050352
C  6.427475 -0.456003 0.578985
C  8.137836 0.607425 1.948305
H  -0.893981 -0.312417 1.725477
H  -0.63948 -1.141444 0.149533
H  -0.58843 0.940476 -2.057849
H  0.794272 1.908714 -1.486298
H  -6.175681 0.076725 2.619208
H  -5.658507 -0.507075 -2.39012
H  0.697704 -2.269449 -1.957146
H  1.197512 -1.308707 -3.384723
H  -0.443916 -1.10501 -2.674757
H  -8.215047 -0.047845 1.11854
H  -7.960621 -0.336392 -1.343738
H  2.924676 -2.164379 -1.952287
H  2.274837 1.674281 0.054447
H  5.220402 -2.238342 -1.004195
H  4.56767 1.55613 0.968026
H  0.265703 3.841039 1.065786
H  8.268066 -0.285061 2.584144
H  8.226432 1.530283 2.539703
H  8.888681 0.580883 1.140003
