program: Gaussian 09
title: 000272911
version: EM64L-G09RevD.01
frameworkgroup: C1[X(C14H19N5O6)]
method: RPBEPBE
basis: SDD
operation: Freq
keyword: #p
keyword: freq=noraman
keyword: PBEPBE/SDD
title: #p freq=noraman PBEPBE/SDD
converged: YES YES NO NO
title: Mulliken charges:
elementType: O O O O O O N N N N N C C C C C C C C C C C C C C H H H H H H H H H H H H H H H H H H H
charge: -0.298244 -0.319645 -0.274534 -0.260365 -0.197083 -0.192141 -0.385569 0.021657 -0.441250 -0.449816 0.036911 0.438926 0.029887 0.132093 -0.509307 0.246074 -0.498373 -0.013454 0.259310 0.272777 -0.254258 -0.254015 -0.567813 -0.662350 -0.661438 0.259088 0.350639 0.228523 0.242540 0.386048 0.340575 0.238514 0.224064 0.238683 0.223073 0.242533 0.228735 0.216323 0.215579 0.228171 0.247410 0.218569 0.222112 0.250845
chargesum: 0.00000
title: Mulliken charges with hydrogens summed into heavy atoms:
elementType: O O O O O O N N N N N C C C C C C C C C C C C C C
charge: -0.298244 -0.319645 -0.274534 -0.260365 -0.197083 -0.192141 -0.034931 0.021657 -0.055203 -0.109241 0.036911 0.438926 0.029887 0.132093 -0.250218 0.246074 -0.027310 0.225060 0.259310 0.272777 0.208489 0.211591 -0.122755 0.028809 0.030087
polarizability: 3.14102196e+02 8.22175363e-01 3.09147669e+02 1.73011423e+01 -6.32622010e+00 1.25648345e+02
1716.lowfreq: -0.0007 -0.0006 0.0004 2.8280 3.9282 6.8731 21.0775 25.6545 30.0351
frequency: 21.0197 25.6346 30.0260 32.4454 38.0105 50.6684 53.8637 61.2258 73.5936 81.8330 88.1234 91.6226 103.8689 126.1718 140.9221 167.8857 192.4264 202.5811 208.9803 221.4374 245.4745 257.4103 272.6041 284.2748 297.3631 315.9911 337.3769 341.9317 367.8181 397.6211 406.4998 427.1155 458.0742 485.9191 525.2158 595.4478 604.5145 630.0405 638.6868 647.6122 651.8943 659.6199 678.3393 691.0416 705.3599 717.4411 725.8347 737.6679 771.2184 785.8377 803.1123 807.6745 811.9271 856.3237 860.4564 878.3571 888.4069 908.1095 946.8396 953.7678 966.8096 999.0741 1011.4745 1017.6520 1030.0743 1049.1609 1079.7957 1094.1472 1096.5934 1116.2282 1129.5197 1138.1178 1156.9822 1159.0428 1168.7597 1202.7667 1231.3440 1236.7518 1259.6095 1281.1646 1281.3540 1282.5770 1305.2073 1330.3998 1351.9327 1356.2951 1358.0809 1389.6894 1390.0161 1418.2113 1426.0297 1454.9619 1458.4793 1459.1005 1463.2406 1464.0908 1471.4707 1483.5569 1483.8376 1485.4371 1513.4140 1552.0505 1578.4108 1597.9513 1655.3123 1683.9816 1703.5923 2975.3869 2991.5163 2991.6119 3030.0502 3030.1515 3036.8842 3086.4320 3086.7569 3087.3362 3091.5437 3092.0006 3111.9744 3117.6602 3118.3532 3182.6845 3199.1147 3264.3469 3296.0066 3550.2841
redmass: 5.0270 3.9904 3.6281 4.6418 4.6438 5.0390 5.0506 4.3140 4.2765 4.1901 3.4749 4.3390 3.6481 4.3503 5.7895 3.3624 3.1041 1.8123 1.5924 3.8855 3.8011 3.0360 4.6343 3.7885 3.9340 3.7611 5.4586 4.4947 3.2068 4.7586 7.7771 3.5316 3.9324 2.7934 8.2068 1.8798 3.0189 1.9473 4.5886 3.6743 5.7891 4.8230 6.0313 6.8470 4.7725 4.7999 5.4653 3.7403 7.5277 1.2203 1.2374 1.2306 1.8458 4.4336 3.6587 1.2191 2.4643 2.3235 2.8275 1.6893 1.8254 1.9417 2.3162 2.3089 4.5315 5.1084 5.9049 2.2487 2.3362 4.1575 2.5982 2.1717 1.7351 1.7097 2.9712 4.1877 4.5361 1.9583 1.4505 1.1096 1.1090 1.2292 2.0890 1.3588 4.0629 1.2565 1.3439 1.2338 1.2335 2.4823 1.1931 2.0221 1.0890 1.2000 1.0465 1.0555 1.3847 1.0527 1.0713 3.8595 2.0110 2.7595 2.9390 4.7969 4.6300 8.4976 8.7362 1.0617 1.0359 1.0359 1.0598 1.0598 1.0999 1.0612 1.0975 1.0973 1.1030 1.1030 1.0948 1.1061 1.1061 1.0919 1.1136 1.0790 1.0801 1.0762
irintensity: 0.2326 2.6819 0.2385 0.8517 0.6511 1.5863 0.4599 0.5821 0.6815 0.0890 0.0756 0.2681 3.2818 1.6849 1.3926 0.5254 0.8725 2.8458 9.5864 1.8791 5.4902 1.2490 4.3187 13.1770 16.5106 15.2031 2.8525 14.2137 1.7546 7.7326 3.4429 0.9373 1.1791 2.6116 7.1614 13.1478 6.1913 59.6710 12.7253 18.3942 5.8328 1.9743 11.4681 18.6697 29.2635 12.6309 15.6368 16.7248 12.1663 95.1668 2.3488 4.1775 38.1424 2.5978 24.6458 126.8785 15.2859 8.4258 69.5164 124.6813 17.5603 6.2247 56.1010 101.4062 100.5633 316.6985 797.9661 133.3553 19.9035 224.0890 196.9517 12.1200 38.6906 4.6347 22.3750 232.3903 541.4247 214.1997 57.5371 4.4414 4.4749 0.5490 15.1935 95.4497 63.7929 6.4021 7.8986 33.5825 28.8670 225.0101 20.8394 184.0179 37.9058 49.5815 11.9801 17.3802 33.7405 13.9354 29.1578 443.0442 413.8244 452.3776 727.9641 623.1470 7.6710 206.6763 212.2822 45.3726 26.7926 17.4173 34.4189 35.4744 10.3168 9.6476 34.7106 44.4858 2.2221 1.1221 7.2292 36.0514 31.1535 2.4587 20.3660 100.1505 160.7141 50.2419
temp: 298.150 k
press: 1.00000 atm
elementType: 8 8 8 8 8 8 7 7 7 7 7 6 6 6 6 6 6 6 6 6 6 6 6 6 6 1 1 1 1 1 1 1 1 1 1 1 1 1 1 1 1 1 1 1
symmnumber: 1
zpe: 882559.4 jmol-1
zpe.correction: 0.336149 hartree
zpe.thermalcorrener: 0.362274 hartree
zpe.thermalcorrenthalpy: 0.363218 hartree
zpe.thermalcorrgfe: 0.275764 hartree
zpe.sumelectzpe: -1268.044480 hartree
zpe.sumelectthermal: -1268.018355 hartree
zpe.sumelectthermalent: -1268.017411 hartree
zpe.sumelectthermalfe: -1268.104865 hartree
dipole: -5.7537 1.7612 -1.3057
dipole: 6.1572
quadrupole: -112.6025 -147.3123 -145.7146
quadrupole: 5.7868 1.8471 3.5587
quadrupole: 22.6073 -12.1025 -10.5048 5.7868 1.8471 3.5587
hfenergy: -1268.3806291 hartree
pointgroup: C01 [X(C14H19N5O6)]
dipole: -0.9420132 2.1409951 -0.6300473 debye
polarizability: 311.4861612|-1.5241135|309.4824735|12.4965597|-24.6378803|127.9295754 unknown
InChI: InChI=1S/C14H19N5O6/c1-4-7-15-9-8-10(17-13(20)24-5-2)16-12(11(9)19(22)23)18-14(21)25-6-3/h4,8,15,17-18H,1,5-7H2,2-3H3
charge 0 multiplicity 1
44 atoms
O  2.599335 -3.539055 0.846576
O  1.76664 3.995684 -0.759471
O  -3.367774 -2.906726 0.165639
O  -1.32636 -3.731317 0.694147
O  2.965646 -1.539914 -0.341357
O  2.440276 2.144314 0.539628
N  -3.694318 -0.420901 -0.430502
N  0.517132 -0.007188 -0.078388
N  0.799286 -2.289125 0.372941
N  0.307953 2.304224 -0.538755
N  -2.070308 -2.720943 0.307378
C  -2.334925 -0.294108 -0.300993
C  -1.490964 -1.436647 0.052008
C  -0.045378 -1.217838 0.113154
C  -1.693745 0.958192 -0.498146
C  -0.292701 1.048628 -0.356892
C  -4.607771 0.665999 -0.811972
C  -4.836656 1.703352 0.28098
C  2.199683 -2.336683 0.229474
C  1.599723 2.719995 -0.171192
C  4.047147 -3.872249 0.722049
C  3.046332 4.686518 -0.428331
C  -4.913283 3.038884 0.063596
C  4.324737 -4.617617 -0.586915
C  2.931284 5.455653 0.890832
H  -2.290591 1.851348 -0.688265
H  -4.047555 -1.379955 -0.267507
H  -4.257668 1.162587 -1.739209
H  -5.57332 0.182975 -1.054988
H  0.318305 -3.160951 0.665224
H  -0.252077 3.032617 -0.986773
H  -4.973893 1.298107 1.293636
H  4.243406 -4.500033 1.605836
H  4.62951 -2.936158 0.783178
H  3.207568 5.357131 -1.287513
H  3.849055 3.929771 -0.382597
H  -5.124963 3.73979 0.877943
H  -4.780822 3.471525 -0.93701
H  5.384635 -4.932064 -0.619469
H  3.693635 -5.519478 -0.667397
H  4.133123 -3.966375 -1.456449
H  3.864003 6.02088 1.074443
H  2.093668 6.173994 0.858891
H  2.779393 4.762661 1.73544
