program: Gaussian 09
title: 000026233
version: EM64L-G09RevD.01
frameworkgroup: C1[X(C8H10Cl2N4S2)]
method: RPBEPBE
basis: SDD
operation: Freq
keyword: #p
keyword: freq=noraman
keyword: PBEPBE/SDD
title: #p freq=noraman PBEPBE/SDD
converged: YES YES NO NO
title: Mulliken charges:
elementType: Cl Cl S S N N N N C C C C C C C C H H H H H H H H H H
charge: 0.039195 0.053363 0.368767 0.106921 0.100721 0.107488 0.120089 0.129445 -0.369150 -0.353057 -0.629644 -0.636087 -0.581137 -0.275561 -0.248724 -0.271088 0.258262 0.218501 0.254405 0.231743 0.214306 0.256392 0.222106 0.218140 0.237180 0.227422
chargesum: 0.00000
title: Mulliken charges with hydrogens summed into heavy atoms:
elementType: Cl Cl S S N N N N C C C C C C C C
charge: 0.039195 0.053363 0.368767 0.106921 0.100721 0.107488 0.120089 0.129445 0.107613 0.133091 0.063161 0.046655 -0.581137 -0.275561 -0.248724 -0.271088
polarizability: 2.41216342e+02 -8.08593763e+00 1.69082024e+02 1.02897176e+01 3.74068515e+00 1.38937442e+02
1716.lowfreq: -2.3085 -0.0014 0.0004 0.0023 2.4345 7.3514 24.0041 30.9527 37.1501
frequency: 23.7336 30.7464 37.0094 69.9955 76.9908 91.4918 126.4391 134.4478 150.1594 158.4424 170.5406 199.9183 207.5429 212.4511 266.6954 293.5946 311.8893 346.6150 367.6476 415.6049 427.7107 428.9973 455.2255 517.0178 538.8199 595.6634 611.7313 621.1458 755.2849 771.6397 779.3726 781.0424 782.6756 800.7471 879.7239 907.3582 949.3272 1010.6489 1063.0670 1077.6044 1096.6098 1149.2017 1153.6318 1177.2546 1188.0981 1220.9823 1234.8737 1275.6546 1289.1248 1334.1531 1348.0550 1377.4647 1390.1691 1393.0433 1434.8672 1441.8848 1463.7828 1466.9840 1469.6767 1479.0402 1483.0034 1512.3735 2989.9150 2993.6143 3010.8210 3024.4287 3072.4643 3082.0112 3091.4652 3094.6091 3108.8052 3111.6558
redmass: 9.2611 8.2508 4.3052 5.9100 3.0685 2.7973 9.5932 6.3251 12.2938 11.5855 5.5277 4.1907 1.0639 1.4587 6.6982 3.5617 4.6024 4.0549 17.2660 4.7969 15.5996 6.8089 6.2143 5.3666 3.7311 5.9692 11.8745 12.3629 2.7370 1.9983 1.7293 12.7433 12.0504 1.6184 13.2660 3.1041 2.4316 2.8035 2.4518 1.8746 1.8917 10.6562 1.9708 5.3307 3.5024 12.2019 11.5043 1.2835 1.2024 1.2738 1.2777 11.1926 1.2042 1.2069 10.3305 1.6304 1.1156 1.0451 1.0512 1.0693 1.0805 1.6098 1.0356 1.0358 1.0603 1.0665 1.1025 1.0989 1.1005 1.0983 1.1013 1.0999
irintensity: 0.6510 1.6162 0.4238 0.1894 0.5590 0.5565 0.0852 1.1410 0.1433 0.2125 1.0247 0.0150 0.3300 1.0706 2.0995 4.8665 1.8038 8.6935 3.7457 7.0090 9.9861 4.2811 2.9656 12.5101 5.7256 0.8694 1.4340 0.0599 62.0410 129.8319 45.2064 103.0784 68.1713 24.1739 11.0776 60.8676 40.6547 23.6140 15.0959 16.9847 13.7560 130.0422 13.9679 223.5225 58.9049 100.7282 8.0466 60.5459 8.0233 13.9047 13.1319 526.2871 7.6416 37.2968 995.9329 141.0514 37.4466 11.4847 9.7326 3.6951 36.6356 105.1066 22.1968 17.9909 35.5408 15.8608 2.1812 8.6548 32.0777 26.7000 12.9828 35.0895
temp: 298.150 k
press: 1.00000 atm
elementType: 17 17 16 16 7 7 7 7 6 6 6 6 6 6 6 6 1 1 1 1 1 1 1 1 1 1
symmnumber: 1
zpe: 468974.9 jmol-1
zpe.correction: 0.178623 hartree
zpe.thermalcorrener: 0.196294 hartree
zpe.thermalcorrenthalpy: 0.197238 hartree
zpe.thermalcorrgfe: 0.130111 hartree
zpe.sumelectzpe: -2244.865953 hartree
zpe.sumelectthermal: -2244.848282 hartree
zpe.sumelectthermalent: -2244.847337 hartree
zpe.sumelectthermalfe: -2244.914465 hartree
dipole: -4.5799 1.0493 4.0928
dipole: 6.2312
quadrupole: -119.2208 -128.5892 -122.6645
quadrupole: -4.5071 -9.3952 -3.5552
quadrupole: 4.2707 -5.0977 0.8270 -4.5071 -9.3952 -3.5552
hfenergy: -2245.0445759 hartree
pointgroup: C01 [X(C8H10Cl2N4S2)]
dipole: 1.9427573 -0.500965 1.4088201 debye
dipolederiv: -0.108658 0.1346832 0.0041615 -0.0401773 -0.9009342 0.0247283 0.0072011 -0.0034986 -0.0511418 -0.9608331 0.2758219 0.131858 0.3239246 -0.1831134 -0.0440944 0.1260069 -0.0381416 -0.0604023 -0.8901849 -0.1371683 0.2762041 -0.3227197 -0.0716706 -0.0077464 0.1583664 -0.1234829 -0.1482178 -0.408837 0.0023142 0.1653104 0.2330019 -0.1206536 -0.070098 0.1776916 0.099783 -0.9165874 -0.7571343 0.2429529 -0.3643167 0.3762205 -0.4579204 0.1942582 -0.2187317 0.0556755 -0.9940197 -2.1006441 -0.1490283 0.3439589 -0.3112054 -0.5359908 0.053873 0.2249485 0.0278198 -0.1169084 -0.9027471 -0.3892801 0.1020033 -0.860907 -1.4061726 0.1796365 0.0582593 0.0287828 -0.0601635 -1.1089839 0.4941239 0.1252551 0.3074599 -1.2096165 0.0012688 0.1432098 -0.0656612 -0.1238741 0.4276169 -0.1645251 0.1163668 -0.1425505 0.3386971 0.0529493 -0.1520861 0.1082617 0.1117935 0.1559398 0.0823091 -0.0388102 0.0463355 0.2044141 0.0630347 0.1611115 0.0663762 0.5806714 -0.0524912 -0.0107334 -0.0871278 -0.004413 -0.0681073 -0.0464808 -0.0121108 -0.0161484 0.0517244 0.0390426 -0.0735915 -0.0156225 -0.0466433 -0.0364126 -0.0345766 -0.0565266 -0.0290569 -0.050585 1.074262 -0.370109 0.0144589 -0.860657 0.0471198 -0.1114769 -0.0851633 -0.1674157 1.5400558 1.9137835 0.3810701 -0.3035093 1.0032985 0.9473117 -0.2704237 -0.1263275 -0.0682779 -0.00601 1.2948965 -0.1104002 -0.1396592 0.2532782 2.0170995 -0.0709143 -0.1247917 0.0090063 0.1037989 2.3298584 -0.319246 -0.322108 -0.123587 1.2263765 -0.010265 -0.3322844 0.0585356 0.1453786 0.0976375 0.0016736 -0.0057413 -0.047495 0.00852 0.0443259 0.1369032 0.0184307 -0.0093773 -0.0565374 0.0104986 -0.1060555 0.0302109 0.0296188 -0.0243906 -0.1519027 -0.0383736 -0.0290438 -0.095968 -0.0145705 0.0539777 0.0085813 0.0491303 -0.0442684 0.0243536 -0.0130775 0.026436 0.0594623 0.0259688 -0.0322091 0.0406763 -0.1003093 0.060451 -0.0514046 0.0178911 -0.0022515 0.0708565 -0.068802 0.0769215 -0.0438065 0.0483043 0.0312334 0.0705845 0.0747822 -0.0698969 0.0177543 -0.0393403 -0.0812316 -0.0268656 0.0907275 0.0404976 -0.0956061 -0.010724 -0.0044798 -0.0679486 0.1208272 0.060159 0.1337812 -0.0220308 -0.0200199 0.0671682 -0.0545681 0.0929789 -0.1421407 0.0026187 0.0248236 0.0552846 0.0789727 -0.0117337 0.0806124 -0.0132419 0.0975624 0.0886339 0.0831438 -0.0201117 0.0449134 -0.0657948 0.0308057 -0.0057318 0.0846853 0.0748311 0.083364 -0.0112115 0.0210441 -0.0259396 0.0924346 -0.0105737 -0.0237497 -0.0083619 -0.1822715 unknown
polarizability: 238.1143581|-8.2849608|169.4793651|-20.2799048|-1.4423831|141.6420852 unknown
InChI: InChI=1S/C8H10Cl2N4S2/c1-3-14(4-2)8(15)16-7-12-5(9)11-6(10)13-7/h3-4H2,1-2H3
charge 0 multiplicity 1
26 atoms
Cl -1.525552 -3.110571 0.058042
Cl -4.863882 1.080045 0.463513
S  0.393384 1.961873 -0.19108
S  1.910277 0.759928 -2.592887
N  2.504981 0.14075 0.014332
N  -2.207647 1.341933 0.13507
N  -0.697509 -0.554136 -0.025483
N  -3.079207 -0.917253 0.219066
C  3.613828 -0.749416 -0.447989
C  2.292169 0.179952 1.489327
C  3.114962 -2.177406 -0.746544
C  3.13757 1.270943 2.175809
C  1.750003 0.786554 -0.911091
C  -0.955926 0.795612 -0.010252
C  -1.795106 -1.32986 0.083308
C  -3.19972 0.43976 0.249218
H  4.050856 -0.299588 -1.355961
H  4.380415 -0.754105 0.348194
H  1.221637 0.326429 1.696974
H  2.56102 -0.820133 1.874461
H  2.653606 -2.640973 0.1436
H  2.367934 -2.161129 -1.557096
H  3.964011 -2.808239 -1.065605
H  4.213214 1.147374 1.95561
H  2.828091 2.275965 1.840846
H  3.004691 1.215092 3.271319
