program: Gaussian 09
title: 000272853
version: EM64L-G09RevD.01
frameworkgroup: C1[X(C21H20O)]
method: RPBEPBE
basis: SDD
operation: Freq
keyword: #pfreq=noraman
keyword: PBEPBE/SDD
title: #p freq=noraman PBEPBE/SDD
converged: NO YES NO NO
title: Mulliken charges:
elementType: O C C C C C C C C C C C C C C C C C C C C C H H H H H H H H H H H H H H H H H H H H
charge: -0.182614 -0.246527 -0.369850 -0.296224 -0.459753 -0.434218 0.124722 -0.418982 0.344686 -0.448996 0.505081 0.325715 -0.470886 -0.340038 -0.403098 -0.406208 -0.222793 -0.242996 -0.245611 -0.237788 -0.233288 -0.244112 0.273738 0.253576 0.193732 0.213367 0.222491 0.222531 0.229948 0.229375 0.212280 0.253613 0.229889 0.238713 0.228831 0.239855 0.223999 0.226451 0.228134 0.226674 0.225901 0.230679
chargesum: 0.00000
title: Mulliken charges with hydrogens summed into heavy atoms:
elementType: O C C C C C C C C C C C C C C C C C C C C C
charge: -0.182614 0.027211 -0.116274 -0.102492 -0.023895 0.018261 0.124722 0.022674 0.344686 -0.195383 0.505081 0.325715 -0.240997 -0.101325 -0.174268 -0.166353 0.001206 -0.016544 -0.017477 -0.011114 -0.007386 -0.013433
polarizability: 2.88643154e+02 5.52036462e+00 1.86057873e+02 -1.49390538e+01 -5.39367538e+00 1.91532298e+02
1716.lowfreq: -7.4784 -3.5130 -0.0006 -0.0003 -0.0002 9.2109 16.5826 29.6992 37.4055
frequency: 15.7039 29.6420 37.3702 50.3385 68.8086 105.5715 114.2498 157.0984 201.5690 217.4767 237.6567 251.1759 279.8699 326.6290 329.5779 359.0172 403.1117 404.2999 440.0114 457.2646 465.1851 487.1590 542.1507 555.9339 590.9494 615.2246 617.3709 623.8611 640.9277 678.5014 699.8830 704.9464 724.9566 756.2559 772.5506 782.2707 796.4569 833.2756 841.4355 848.2601 853.1123 874.9077 890.6197 903.7628 918.7183 920.2754 933.5613 965.0222 974.5921 976.3155 988.3338 989.8163 994.3924 995.0208 996.3360 1025.5440 1027.0751 1033.3826 1053.3970 1076.6730 1082.5681 1085.2791 1093.6444 1117.6880 1147.7922 1171.6814 1173.7845 1188.8080 1195.4649 1196.2267 1202.7452 1220.9125 1237.3550 1244.5532 1255.4252 1261.8100 1287.1401 1301.3765 1313.8655 1324.2188 1330.1081 1335.6998 1344.2467 1348.8339 1355.5931 1375.9683 1382.2267 1434.1934 1440.4856 1460.5477 1467.9224 1475.0842 1480.3351 1484.5123 1580.6397 1592.0360 1609.3441 1610.9103 1639.8204 1645.8353 2940.8460 2971.5470 2981.8910 2995.0678 3027.7054 3040.6353 3044.2217 3046.7199 3055.3856 3110.8585 3112.2189 3123.2266 3123.7774 3128.9220 3134.6175 3141.6726 3145.5004 3149.5455 3162.6908 3165.3700
redmass: 3.7896 4.0427 4.6654 4.3460 6.5155 4.4360 4.9561 4.5321 3.7634 5.0013 3.2767 3.2631 4.2522 2.2711 3.8285 3.4227 2.8050 2.8305 3.6880 4.7158 4.7246 3.8544 3.2246 3.2303 5.2738 6.4086 6.3240 5.1689 4.2035 4.5682 1.7106 1.7381 3.2232 2.1749 1.9922 2.5177 2.9384 2.7529 2.2131 1.2588 1.2489 2.4321 1.7625 1.7191 1.7220 1.5252 2.5499 2.8529 1.4397 1.3903 5.3854 5.4123 1.4922 1.7798 1.8733 2.2308 2.2326 2.0167 1.8606 1.5558 1.6009 1.6136 2.1790 1.7755 1.2639 1.0596 1.0532 1.1164 2.4719 1.1495 1.6290 1.5048 1.6246 1.7966 1.5246 1.4248 1.3126 1.4988 1.4636 1.4446 1.5832 1.4061 1.4604 1.4228 1.5731 5.8980 7.0997 2.3152 2.1606 1.0859 1.0796 1.0938 2.2495 2.2720 5.6995 6.0454 6.0526 6.0792 9.7126 7.5375 1.0825 1.0600 1.0604 1.0638 1.1005 1.1003 1.0843 1.0871 1.1032 1.0876 1.0898 1.0844 1.0858 1.0870 1.0910 1.0918 1.0958 1.0962 1.1014 1.1016
irintensity: 0.0625 0.0550 0.3888 0.5823 2.2006 0.8035 0.7255 0.6000 0.3924 1.2172 0.8116 0.0333 0.4956 0.5103 0.1288 1.0812 0.1683 0.0368 1.8411 10.2112 0.0362 15.8210 1.4662 7.9825 3.9263 0.5913 0.1575 1.1286 3.4034 6.0097 46.2308 47.9406 2.6449 26.2260 49.2784 31.2740 4.8528 0.5637 0.3509 0.8180 0.1191 5.2529 18.4087 22.5312 2.6107 3.9290 5.2825 1.9461 0.6533 0.3578 0.2734 0.4593 0.2216 0.5868 0.5226 4.6714 13.9285 5.1493 5.8542 19.9414 5.5475 9.5437 0.1762 5.4895 2.7551 0.0758 0.0201 1.6190 0.1644 0.3866 0.5999 2.5583 9.8503 1.9752 5.9997 13.0974 6.0659 9.0970 9.8169 4.0077 15.0335 7.0334 3.8534 1.5369 4.4582 1.3633 1.0466 8.5666 10.5146 9.2010 10.4231 13.4754 23.2801 15.1675 1.6669 0.9638 11.1167 6.8578 168.2180 4.2400 25.1657 36.0394 30.9304 33.1928 27.4454 26.1723 25.1533 3.7210 65.2293 8.8134 15.0376 4.0302 1.2032 0.4667 13.8268 16.0420 38.6326 38.9771 29.2227 23.9584
temp: 298.150 k
press: 1.00000 atm
elementType: 8 6 6 6 6 6 6 6 6 6 6 6 6 6 6 6 6 6 6 6 6 6 1 1 1 1 1 1 1 1 1 1 1 1 1 1 1 1 1 1 1 1
symmnumber: 1
zpe: 912475.3 jmol-1
zpe.correction: 0.347543 hartree
zpe.thermalcorrener: 0.365435 hartree
zpe.thermalcorrenthalpy: 0.366379 hartree
zpe.thermalcorrgfe: 0.299494 hartree
zpe.sumelectzpe: -885.899506 hartree
zpe.sumelectthermal: -885.881614 hartree
zpe.sumelectthermalent: -885.880670 hartree
zpe.sumelectthermalfe: -885.947556 hartree
dipole: -1.2679 -0.0177 -3.2005
dipole: 3.4425
quadrupole: -118.4373 -126.2477 -130.1601
quadrupole: -0.7204 -7.3246 -7.3046
quadrupole: 6.5111 -1.2994 -5.2117 -0.7204 -7.3246 -7.3046
hfenergy: -886.2470491 hartree
pointgroup: C01 [X(C21H20O1)]
dipole: -0.5379358 0.2249464 -1.2224484 debye
polarizability: 287.6042579|8.7068045|188.345174|-16.6030045|-6.3834378|190.2838937 unknown
InChI: InChI=1S/C21H20O/c22-21-17-12-7-13-18(21)20(16-10-5-2-6-11-16)14-19(17)15-8-3-1-4-9-15/h1-6,8-11,14,17-19H,7,12-13H2
charge 0 multiplicity 1
42 atoms
O  0.963959 1.350376 2.637785
C  1.385404 1.757453 0.247315
C  -0.942627 1.233571 1.096944
C  1.307098 0.58814 -0.810221
C  0.865184 3.120325 -0.323618
C  -1.479747 2.613498 0.566312
C  0.528499 1.417553 1.458161
C  -0.650373 3.10823 -0.640944
C  -1.086322 0.151078 0.020994
C  -0.047183 -0.105023 -0.830104
C  2.44888 -0.419891 -0.601024
C  -2.396838 -0.555726 -0.102631
C  3.616483 -0.351566 -1.401982
C  2.377807 -1.405749 0.416416
C  -3.189598 -0.862176 1.038956
C  -2.891426 -0.950229 -1.379504
C  4.691995 -1.244681 -1.192741
C  3.451203 -2.297417 0.630213
C  4.612871 -2.221022 -0.173285
C  -4.416046 -1.549816 0.911973
C  -4.115705 -1.638308 -1.507815
C  -4.886465 -1.943506 -0.361482
H  2.433736 1.880169 0.570742
H  -1.493039 0.965362 2.014968
H  1.469014 1.050429 -1.808922
H  1.448002 3.373662 -1.231053
H  1.078363 3.90869 0.426232
H  -1.423264 3.349421 1.393028
H  -2.546333 2.506013 0.293042
H  -0.844709 2.455709 -1.512772
H  -0.977449 4.126262 -0.926229
H  -0.147827 -0.903353 -1.577887
H  3.682543 0.403666 -2.195957
H  1.478781 -1.474456 1.040113
H  -2.837094 -0.589734 2.039667
H  -2.320504 -0.691302 -2.278345
H  5.586356 -1.180495 -1.823037
H  3.382622 -3.05101 1.422858
H  5.444848 -2.914836 -0.008332
H  -5.001306 -1.782585 1.808698
H  -4.475687 -1.925491 -2.502322
H  -5.84001 -2.473831 -0.460213
