program: Gaussian 09
title: 000272861
version: EM64L-G09RevD.01
frameworkgroup: C1[X(C22H19NO3)]
method: RPBEPBE
basis: SDD
operation: Freq
keyword: #p
keyword: freq=noraman
keyword: PBEPBE/SDD
title: #p freq=noraman PBEPBE/SDD
converged: YES YES NO NO
title: Mulliken charges:
elementType: O O O N C C C C C C C C C C C C C C C C C C C C C C H H H H H H H H H H H H H H H H H H H
charge: -0.254640 -0.438528 -0.247528 -0.116845 -0.540529 -0.549222 0.497694 0.508073 0.128286 0.214247 -0.386418 -0.417848 -0.439023 -0.362558 0.090269 -0.344026 -0.244507 -0.228453 -0.230409 -0.236260 -0.330719 -0.228614 -0.247036 -0.239110 -0.225518 0.102142 0.272972 0.236584 0.237365 0.254390 0.299554 0.243468 0.230881 0.234399 0.250317 0.225974 0.229625 0.224469 0.225663 0.281107 0.238865 0.225984 0.229964 0.238415 0.387089
chargesum: 0.00000
title: Mulliken charges with hydrogens summed into heavy atoms:
elementType: O O O N C C C C C C C C C C C C C C C C C C C C C C
charge: -0.254640 -0.051439 -0.247528 -0.116845 -0.030973 -0.057467 0.497694 0.508073 0.128286 0.214247 -0.086864 -0.174380 -0.208142 -0.128159 0.090269 -0.093709 -0.018533 0.001173 -0.005941 -0.010597 -0.049612 0.010250 -0.021052 -0.009146 0.012897 0.102142
polarizability: 3.11563332e+02 -1.04325488e+01 2.71020477e+02 -6.22391516e+00 3.72453950e+01 1.60885027e+02
1716.lowfreq: -7.6128 -0.0004 0.0004 0.0008 2.3599 8.6582 18.8288 23.0163 29.2549
frequency: 18.7438 22.9515 28.9619 34.5237 39.2481 54.6059 62.3059 69.9374 91.8116 105.6308 128.9545 141.7534 191.7926 213.5627 222.5730 231.7158 257.4024 313.8686 328.3638 357.6045 370.2471 385.7460 403.0760 406.6303 415.7007 435.6889 464.4353 480.6655 510.9965 556.1657 589.9771 592.5985 598.7852 611.8828 616.5937 617.1269 640.9305 689.3836 701.0564 705.0384 707.4209 713.5233 743.9221 761.1951 771.1237 784.1922 795.4596 806.0350 815.8535 853.8354 863.4020 891.8783 900.5899 918.3913 930.0277 953.4456 976.1043 977.5272 984.1886 988.3702 989.9123 991.7446 997.5416 1003.8128 1004.9216 1006.4417 1025.8843 1027.5503 1042.7873 1080.6526 1087.8423 1104.3717 1141.5636 1160.6171 1163.0310 1171.1996 1172.2415 1179.7401 1187.4606 1193.7846 1211.4687 1212.5844 1234.5905 1264.3340 1274.3456 1320.1856 1322.1262 1325.8858 1348.2348 1359.7860 1377.9728 1382.6238 1386.0954 1407.9944 1429.2055 1440.9408 1444.0245 1461.0326 1469.0589 1479.0021 1484.7268 1487.4624 1558.1201 1575.0935 1594.1466 1595.2110 1602.6662 1613.9648 1614.6025 1638.3319 2992.5159 2996.7337 3048.8343 3065.4744 3111.4072 3120.5145 3123.6164 3124.2088 3132.6189 3136.0553 3137.8079 3146.4365 3146.9232 3154.8754 3162.6560 3163.4360 3165.8604 3182.3144 3532.0705
redmass: 4.2065 5.7499 5.0809 5.1750 5.0437 6.0996 5.4715 9.8151 4.6519 4.6301 6.0811 5.9598 4.5879 5.3213 5.4580 4.9981 4.7545 5.0194 4.6569 4.7083 2.0899 5.3030 2.8055 2.8434 3.3307 3.0219 3.4261 4.4783 5.7372 4.3290 1.8221 2.5347 3.8094 4.0291 6.1997 6.1031 5.2638 3.9594 4.1745 2.5199 2.1597 2.6668 1.7990 2.6087 2.3639 2.8950 2.3917 3.6905 3.6862 1.2522 1.2527 1.9834 1.6139 1.4340 1.7663 1.8512 1.4153 1.4127 1.4138 2.1903 5.3192 4.8885 1.3494 1.4075 1.6925 3.0271 2.2246 2.2460 2.3521 1.7262 1.5931 1.9669 1.7187 3.0916 1.7913 1.0552 1.0578 1.0745 1.1173 1.1410 2.6072 2.7294 1.6756 1.5532 1.4926 1.9009 1.6560 1.3800 1.3293 1.4779 9.7133 6.1021 4.4921 2.7727 2.3097 2.1078 2.0633 1.1527 1.1777 2.7591 2.0763 2.1220 8.5053 7.0925 6.0221 6.0178 6.2228 6.0597 5.8201 8.5693 1.0594 1.0634 1.1015 1.0977 1.0869 1.0850 1.0876 1.0870 1.0865 1.0917 1.0929 1.0962 1.0913 1.0967 1.0963 1.1015 1.0986 1.0972 1.0642
irintensity: 0.1434 0.0808 0.0117 1.0124 0.4201 0.6832 0.6441 2.0508 1.3402 0.0504 0.0572 1.3902 0.3471 3.6850 1.2935 2.2401 7.7381 2.1690 8.3911 5.6320 7.6016 8.6941 0.0451 0.2609 9.5941 15.6271 0.9384 30.4471 2.4374 19.9047 52.2172 59.3235 28.1869 17.0939 1.5735 1.0067 8.6343 67.1243 14.5768 41.4583 49.0718 21.5090 39.9296 55.9488 40.1002 9.5031 17.3806 1.9332 18.0610 0.6539 0.2579 2.6374 9.2701 3.1860 3.0352 19.4804 12.8614 2.2568 3.7051 67.8346 0.7528 0.8300 6.8231 14.3368 74.4093 149.8343 5.8927 11.7159 9.0308 26.8918 2.5743 69.6165 35.7896 14.9133 69.6787 0.0246 0.6042 0.2387 0.9458 0.3542 3.2380 10.7620 89.7074 74.1832 7.0818 50.8918 43.0929 22.0704 8.4937 7.7157 8.6387 21.7130 2.6674 111.6367 26.8862 5.3914 7.7235 19.7316 18.0023 10.1342 8.0719 19.0088 296.9199 39.9983 2.4960 3.9603 18.2739 3.6907 5.8742 301.4396 33.2040 15.4252 12.6889 10.5243 9.2268 4.9272 1.3437 2.8800 2.3983 15.7982 36.4106 37.7707 12.0763 15.2641 16.5224 24.7034 27.3541 8.9830 52.1123
temp: 298.150 k
press: 1.00000 atm
elementType: 8 8 8 7 6 6 6 6 6 6 6 6 6 6 6 6 6 6 6 6 6 6 6 6 6 6 1 1 1 1 1 1 1 1 1 1 1 1 1 1 1 1 1 1 1
symmnumber: 1
zpe: 927936.1 jmol-1
zpe.correction: 0.353432 hartree
zpe.thermalcorrener: 0.375949 hartree
zpe.thermalcorrenthalpy: 0.376893 hartree
zpe.thermalcorrgfe: 0.298089 hartree
zpe.sumelectzpe: -1128.367015 hartree
zpe.sumelectthermal: -1128.344499 hartree
zpe.sumelectthermalent: -1128.343555 hartree
zpe.sumelectthermalfe: -1128.422359 hartree
dipole: -0.6404 2.8280 -3.2825
dipole: 4.3798
quadrupole: -129.8173 -135.6790 -158.6127
quadrupole: -1.6225 4.5809 15.2788
quadrupole: 11.5524 5.6907 -17.2430 -1.6225 4.5809 15.2788
hfenergy: -1128.7204477 hartree
pointgroup: C01 [X(C22H19N1O3)]
dipole: -1.0090707 0.6528959 -1.2347886 debye
polarizability: 299.49967|18.4416036|278.7479686|-41.0908347|18.9969037|165.221197 unknown
InChI: InChI=1S/C22H19NO3/c24-21(19-13-7-8-14-20(19)22(25)26)23(15-17-9-3-1-4-10-17)16-18-11-5-2-6-12-18/h1-14,25H,15-16H2
charge 0 multiplicity 1
45 atoms
O  -0.092942 -1.465171 2.42258
O  -1.18144 -4.436614 -1.270661
O  0.349487 -2.836529 -0.59679
N  0.162942 0.100643 0.705304
C  1.394254 0.64193 1.32974
C  -0.205203 0.618857 -0.633319
C  2.659765 0.43244 0.502589
C  -0.445074 2.127249 -0.653764
C  -0.495709 -0.943794 1.333106
C  -1.840953 -1.395521 0.779325
C  2.936452 -0.821248 -0.101243
C  0.429654 2.982179 -1.368122
C  3.598057 1.485373 0.366823
C  -1.549508 2.696473 0.030913
C  -2.020992 -2.533205 -0.062984
C  -2.990317 -0.749542 1.299098
C  4.138673 -1.013952 -0.817291
C  0.204314 4.377854 -1.404913
C  4.80436 1.289808 -0.344204
C  -1.77667 4.089204 -0.001064
C  -3.330376 -2.991067 -0.370407
C  -4.288526 -1.201973 0.981316
C  5.078831 0.036897 -0.9389
C  -0.899559 4.935448 -0.720854
C  -4.461267 -2.327865 0.142463
C  -0.840777 -3.232397 -0.635148
H  1.485194 0.125231 2.303156
H  1.248909 1.721444 1.524057
H  -1.112129 0.08293 -0.960966
H  0.605584 0.361486 -1.341103
H  2.208132 -1.634442 -0.018093
H  1.292432 2.552841 -1.892238
H  3.384138 2.461931 0.82026
H  -2.23463 2.044369 0.585394
H  -2.859845 0.097823 1.981194
H  4.343209 -1.986821 -1.279075
H  0.888668 5.026395 -1.963289
H  5.523595 2.111772 -0.43658
H  -2.635914 4.516129 0.528724
H  -3.439456 -3.868659 -1.01281
H  -5.160585 -0.684224 1.395346
H  6.011957 -0.118211 -1.492491
H  -1.07635 6.016549 -0.747605
H  -5.466215 -2.686757 -0.102194
H  -0.351668 -4.852959 -1.627578
