program: Gaussian 09
title: 000272874
version: EM64L-G09RevD.01
frameworkgroup: C1[X(C25H32N2O)]
method: RPBEPBE
basis: SDD
operation: Freq
keyword: #p
keyword: freq=noraman
keyword: PBEPBE/SDD
title: #p freq=noraman PBEPBE/SDD
converged: NO YES NO NO
title: Mulliken charges:
elementType: O N N C C C C C C C C C C C C C C C C C C C C C C C C C H H H H H H H H H H H H H H H H H H H H H H H H H H H H H H H H
charge: -0.481674 -0.182834 -0.058238 -0.453164 -0.374072 -0.331329 -0.193570 -0.367735 -0.359184 0.413834 -0.353171 -0.342218 0.237877 -0.464729 -0.106105 0.030916 -0.687640 -0.692328 -0.391593 -0.329813 0.333991 -0.275169 -0.233512 -0.375004 -0.371840 -0.252738 -0.232973 -0.240453 0.227797 0.236978 0.203254 0.207306 0.186735 0.217630 0.209960 0.195846 0.192829 0.190968 0.202806 0.238529 0.188675 0.197480 0.193601 0.278966 0.362877 0.203760 0.221983 0.209109 0.209144 0.219013 0.214062 0.222013 0.262214 0.226220 0.230818 0.227844 0.280552 0.224064 0.224517 0.226917
chargesum: 0.00000
title: Mulliken charges with hydrogens summed into heavy atoms:
elementType: O N N C C C C C C C C C C C C C C C C C C C C C C C C C
charge: -0.118797 -0.182834 -0.058238 0.011612 0.036488 0.073036 0.016389 0.020940 0.034590 0.413834 0.074032 0.048863 0.237877 -0.185763 -0.106105 0.030916 -0.052788 -0.050109 -0.169580 -0.067599 0.333991 -0.048949 -0.002694 -0.147160 -0.091288 -0.028674 -0.008456 -0.013536
polarizability: 3.59532391e+02 -4.09268769e+01 3.83078882e+02 1.06165943e+01 4.55659901e+01 1.93617548e+02
1716.lowfreq: -15.9184 -6.0519 -0.0006 0.0004 0.0007 2.7749 7.2520 13.2675 15.4216
frequency: -10.9687 13.0077 15.0185 21.3540 23.7852 41.1839 49.6519 51.4071 66.5548 78.6219 92.6612 104.0946 124.2582 134.3752 142.4164 171.1990 180.9187 184.2718 221.7109 223.2218 225.9734 244.7501 273.4947 278.8012 285.9245 296.2381 307.9991 337.0505 354.2932 375.9385 402.3580 423.3785 443.7714 465.0649 471.3031 478.7794 516.0582 533.7800 546.9918 563.2329 594.8498 610.8852 617.5791 635.6653 673.4860 686.5826 697.9568 728.7484 734.1682 755.0741 767.7191 773.2563 782.1232 787.0818 797.3111 806.8821 822.7031 843.2751 855.1919 857.0484 875.8787 880.2358 899.8847 908.3877 927.8975 929.9950 938.6479 947.6479 958.5372 970.3605 986.6173 988.8244 991.9072 992.8587 1007.6524 1008.5734 1023.0624 1025.3026 1032.8436 1050.5191 1062.8235 1072.5333 1076.9242 1083.2380 1085.5278 1102.6864 1113.6972 1123.4774 1137.0726 1139.4957 1169.6275 1171.0702 1185.9115 1188.7548 1209.8625 1218.6123 1226.7671 1242.3802 1248.4259 1258.7404 1268.1067 1277.5369 1279.2821 1285.3555 1289.9600 1301.5760 1302.5063 1311.4261 1317.3872 1324.8168 1330.2952 1347.6476 1358.3451 1359.0407 1370.5358 1378.7185 1382.1021 1385.5513 1388.6753 1390.4897 1396.3758 1416.4722 1439.5607 1448.6783 1454.9497 1465.6235 1469.1767 1470.4169 1472.9607 1474.8131 1476.3322 1476.9090 1479.5108 1487.5677 1488.1325 1488.9446 1510.6553 1540.3654 1586.3222 1594.0637 1610.4035 1621.0283 2878.2660 2887.4802 2937.0265 2965.6079 2966.2909 2971.0920 2974.5259 2975.4718 2976.4138 2977.8308 3006.0417 3006.6033 3024.9712 3033.1809 3041.1238 3047.9747 3056.9411 3068.2940 3071.9514 3074.7250 3074.9363 3122.5816 3122.9989 3133.8799 3136.1361 3138.3259 3148.5670 3152.6598 3160.0266 3168.6085 3169.7743 3187.8449
redmass: 3.0439 3.9079 3.5367 2.7654 2.4193 2.3643 3.8424 2.9990 4.2332 3.7701 2.7672 5.1165 2.2298 3.3591 3.3303 5.1259 3.7985 2.7057 1.3767 2.0904 1.6692 2.1757 3.9251 2.8346 3.7869 3.4173 4.6836 3.2364 3.7966 4.7607 2.8210 2.9879 2.5366 3.3339 2.8961 3.2324 6.1676 3.3289 3.3216 6.3903 4.1612 5.0676 5.8066 4.7361 5.4397 3.5268 1.6694 1.3359 1.1466 2.3413 1.3946 1.3977 1.9597 1.4441 2.0782 2.0097 1.7862 3.4266 1.5254 2.8510 1.7248 1.7237 1.7273 3.6655 1.3474 1.4545 1.4696 1.3321 1.3827 2.6414 1.4884 4.3408 4.4671 1.3531 1.3523 2.3948 2.3594 2.2690 3.2412 2.7090 2.5128 3.4059 2.5204 2.1734 1.8422 1.9827 2.0364 2.3351 1.5393 1.6556 1.0960 1.1228 2.0995 1.1811 1.5498 1.5576 1.3838 1.4346 1.4579 1.3696 1.3158 1.2572 2.3987 1.0843 1.1167 1.4748 1.6945 1.3407 1.2456 1.3954 1.4519 1.5088 1.6346 2.7903 1.3398 1.5627 3.8892 1.2197 2.3050 1.4192 2.0193 2.6276 2.5231 2.8641 1.0809 1.0778 1.0790 1.0715 1.0805 1.0520 1.0429 1.0446 1.0681 2.5441 1.0994 1.0908 3.7381 7.1120 6.5106 6.7836 6.0539 6.4706 1.0707 1.0695 1.0821 1.0585 1.0580 1.0385 1.0416 1.0607 1.0573 1.0604 1.0965 1.0975 1.0942 1.0946 1.0973 1.0993 1.1005 1.1011 1.1007 1.0995 1.0989 1.0851 1.0847 1.0887 1.0894 1.0630 1.0933 1.0950 1.0964 1.0994 1.0984 1.0900
irintensity: 0.0415 0.0301 0.0441 0.0274 0.0700 0.0918 1.0571 0.9459 0.6618 0.3978 0.4428 1.6066 0.2492 0.8653 0.0492 0.2841 4.4122 2.7176 0.1168 0.3394 0.1983 0.1016 2.4304 0.1276 0.7661 0.3721 1.9061 0.3804 12.0446 2.0373 0.0103 0.4461 1.0584 5.8442 2.4980 3.7156 2.1952 12.4298 6.2094 1.7801 2.8574 8.1549 0.9153 4.8048 7.8316 16.3082 57.0699 12.5214 11.1361 3.8127 66.5169 12.8090 82.3880 6.8018 29.4337 19.0271 10.3495 1.8855 0.9914 1.2504 2.5731 4.2119 11.8446 8.7096 13.7560 24.1027 3.6217 1.8477 2.2182 13.8378 0.5823 4.1405 21.0645 1.5951 1.7260 14.1568 1.4392 16.1300 12.2644 3.6791 42.7490 23.5702 10.2830 45.6894 9.8120 14.8110 2.4381 16.5294 9.1906 7.5249 1.5076 1.6338 19.7507 14.6650 24.9149 1.7189 8.9615 12.0231 4.0880 2.2560 3.5308 1.5103 1.3573 1.4569 2.1922 0.7813 20.3341 16.8053 0.2399 9.7191 3.7925 3.7448 3.5986 42.0398 11.2196 30.2526 1.8004 13.8595 18.4628 10.5450 75.1264 8.0647 27.7479 5.8695 6.9951 1.6052 4.3195 2.1791 7.2077 6.6369 9.9712 9.1232 5.8732 5.4496 18.2671 21.1125 27.1694 44.5915 17.8922 102.5597 2.3594 5.4229 48.6223 130.8005 40.8977 12.5431 12.7294 39.8867 40.2481 16.0933 39.4976 77.3053 9.3031 13.4632 5.5307 7.4498 20.2994 62.4367 29.4128 99.8365 92.8456 45.3032 48.2074 5.4964 0.9798 10.6388 18.8313 263.1472 36.0812 32.0005 21.2686 28.9184 20.4302 0.9209
temp: 298.150 k
press: 1.00000 atm
elementType: 8 7 7 6 6 6 6 6 6 6 6 6 6 6 6 6 6 6 6 6 6 6 6 6 6 6 6 6 1 1 1 1 1 1 1 1 1 1 1 1 1 1 1 1 1 1 1 1 1 1 1 1 1 1 1 1 1 1 1 1
symmnumber: 1
zpe: 1341208.3 jmol-1
zpe.correction: 0.510839 hartree
zpe.thermalcorrener: 0.537951 hartree
zpe.thermalcorrenthalpy: 0.538895 hartree
zpe.thermalcorrgfe: 0.449309 hartree
zpe.sumelectzpe: -1154.508019 hartree
zpe.sumelectthermal: -1154.480907 hartree
zpe.sumelectthermalent: -1154.479963 hartree
zpe.sumelectthermalfe: -1154.569549 hartree
dipole: 4.8289 -0.3048 -2.1002
dipole: 5.2747
quadrupole: -157.1189 -153.2606 -174.7015
quadrupole: -3.6384 -1.4119 4.0355
quadrupole: 4.5747 8.4331 -13.0078 -3.6384 -1.4119 4.0355
hfenergy: -1155.018858 hartree
pointgroup: C01 [X(C25H32N2O1)]
dipole: 1.7077974 -1.071714 0.4913483 debye
polarizability: 350.2699083|-5.9588167|184.3002978|29.525155|-26.7296689|401.6586158 unknown
InChI: InChI=1S/C25H32N2O/c1-3-5-16-27(17-6-4-2)19-25(28)22-18-24(20-12-8-7-9-13-20)26-23-15-11-10-14-21(22)23/h7-15,18,25,28H,3-6,16-17,19H2,1-2H3
charge 0 multiplicity 1
60 atoms
O  1.310075 0.765625 -0.312599
N  2.787968 -1.245235 0.563155
N  -3.611607 -0.009323 0.604201
C  1.368156 -1.276334 1.016872
C  3.775444 -1.28759 1.683434
C  3.106546 -2.234248 -0.5144
C  0.757193 0.173449 0.898989
C  3.735479 -0.075958 2.638623
C  4.30736 -1.822598 -1.391397
C  -0.759514 0.142914 0.832451
C  4.126595 1.271366 1.989887
C  4.566291 -2.832564 -2.534544
C  -1.55609 -0.104646 2.010947
C  -1.408065 0.324765 -0.388087
C  -2.993808 -0.180028 1.830661
C  -2.841116 0.249316 -0.482386
C  4.157894 2.42929 3.010531
C  5.766895 -2.433218 -3.418877
C  -1.02013 -0.272459 3.329804
C  -3.830506 -0.436011 2.965649
C  -3.551519 0.445489 -1.78196
C  -1.860796 -0.51541 4.420215
C  -3.276649 -0.603195 4.236544
C  -2.878846 0.891549 -2.952975
C  -4.948491 0.187444 -1.860862
C  -3.580789 1.069164 -4.164561
C  -5.648119 0.362322 -3.071096
C  -4.967797 0.803457 -4.231743
H  1.265244 -1.664829 2.04964
H  0.787388 -1.939064 0.350391
H  3.630542 -2.224867 2.275445
H  4.785409 -1.341928 1.237819
H  3.292109 -3.24802 -0.08273
H  2.215493 -2.317112 -1.163597
H  1.074338 0.773637 1.779123
H  4.438559 -0.293286 3.469459
H  2.73478 0.011302 3.109082
H  5.226764 -1.733981 -0.779313
H  4.111767 -0.818171 -1.81738
H  3.418743 1.517354 1.176331
H  5.123693 1.164991 1.515549
H  3.656204 -2.916907 -3.162676
H  4.74272 -3.839361 -2.103458
H  -0.785789 0.527854 -1.2612
H  2.226839 0.329286 -0.352617
H  4.88541 2.231333 3.820834
H  4.440375 3.382229 2.527604
H  3.165379 2.573189 3.47839
H  6.697334 -2.374962 -2.823157
H  5.930762 -3.165546 -4.230295
H  5.604256 -1.443217 -3.884563
H  0.060576 -0.195216 3.494254
H  -4.909834 -0.48744 2.792302
H  -1.436599 -0.634228 5.423456
H  -3.924368 -0.795075 5.099082
H  -1.808375 1.118717 -2.926489
H  -5.457169 -0.14597 -0.95161
H  -3.045872 1.4191 -5.054693
H  -6.723753 0.156176 -3.11237
H  -5.511281 0.94108 -5.173391
