program: Gaussian 09
title: 000272843
version: EM64L-G09RevD.01
frameworkgroup: C1[X(C19H19BrO)]
method: RPBEPBE
basis: SDD
operation: Freq
keyword: #p
keyword: freq=noraman
keyword: PBEPBE/SDD
title: #p freq=noraman PBEPBE/SDD
converged: YES YES NO NO
title: Mulliken charges:
elementType: Br O C C C C C C C C C C C C C C C C C C C H H H H H H H H H H H H H H H H H H H
charge: 0.011911 -0.159350 0.007917 -0.499286 -0.408946 -0.422779 0.210969 -0.637780 -0.364027 0.356845 0.435586 -0.335042 -0.395986 -0.415359 -0.373708 -0.242688 -0.242587 -0.245852 -0.268098 -0.241480 -0.245886 0.249992 0.189914 0.236379 0.203860 0.203876 0.220020 0.292746 0.243268 0.244071 0.274159 0.253205 0.246642 0.249927 0.230852 0.224532 0.226624 0.226042 0.231188 0.228328
chargesum: 0.00000
title: Mulliken charges with hydrogens summed into heavy atoms:
elementType: Br O C C C C C C C C C C C C C C C C C C C
charge: 0.011911 -0.159350 0.007917 -0.059380 0.031293 0.001117 0.210969 -0.345033 0.123312 0.356845 0.435586 -0.060884 -0.142781 -0.168717 -0.123781 -0.011836 -0.018055 -0.019228 -0.042056 -0.010292 -0.017558
polarizability: 2.23794830e+02 7.08075264e+00 2.33902556e+02 1.36798192e+00 9.37967708e+00 1.82534827e+02
1716.lowfreq: -4.4513 -0.0003 0.0002 0.0003 1.8463 10.1954 25.1889 34.6135 52.3438
frequency: 25.0474 34.5596 52.3333 64.3182 75.0220 97.5401 136.4917 156.8960 166.0633 200.4759 219.9921 229.3788 257.3952 263.4724 283.6175 300.0123 325.9641 329.5364 365.5979 400.9344 409.1356 460.1700 483.7179 489.1351 567.9350 571.2595 613.0550 616.3699 619.7614 665.5867 702.0192 705.0201 708.7526 736.1943 754.3396 762.8070 792.3655 828.3806 844.5397 851.4175 855.0971 868.0515 908.7433 926.4667 931.1375 939.8099 963.1655 977.1379 983.3723 990.3024 990.8365 994.9332 1000.7381 1015.6412 1028.4512 1031.5272 1056.2397 1059.6395 1086.1877 1090.6175 1105.1733 1116.7291 1125.9817 1162.1150 1173.5956 1175.4880 1186.7047 1200.3549 1201.9536 1204.9591 1232.5009 1238.1310 1277.5084 1302.8004 1322.4130 1325.5339 1326.7558 1332.7537 1344.0795 1353.6845 1374.2309 1378.6769 1432.8826 1433.8639 1461.3170 1468.2891 1472.7945 1475.5348 1482.3039 1484.7652 1586.2645 1588.5375 1605.6989 1609.4630 1621.8835 2968.9104 2983.8538 2989.2840 3002.1356 3031.5227 3044.3388 3046.7314 3063.1711 3078.7897 3121.3604 3125.7032 3129.6402 3133.8220 3142.2402 3146.2648 3155.5675 3157.4613 3167.1292 3171.1540
redmass: 5.8605 5.1489 4.6581 4.8909 4.3478 4.1050 6.0674 4.1519 5.5105 5.4998 3.0165 4.5586 5.8907 3.2007 3.4311 3.9830 3.1291 4.6753 3.0002 2.8338 2.8495 3.5538 2.8935 2.3377 4.6497 3.3350 5.1586 6.3353 5.6928 5.4497 3.1979 1.8233 1.7693 3.1856 2.4188 1.9390 2.5669 2.0929 2.3437 1.2540 1.2663 2.2380 2.4552 1.5923 1.5065 2.8167 2.2854 1.3925 1.3959 4.5508 3.9987 1.5829 1.3340 2.4056 2.6001 2.2627 2.4718 2.2239 2.0974 1.6533 1.9465 2.6915 1.4240 3.6830 1.0533 1.0539 1.7404 1.1383 1.1288 1.2590 1.5512 1.2506 1.3033 1.4174 1.3322 1.3362 1.2991 1.3411 1.4555 1.3743 6.5504 6.6084 2.2433 2.2275 1.0886 1.0897 1.1438 1.1351 2.0139 1.8021 5.8514 6.0001 5.8959 6.0870 10.5499 1.0627 1.0613 1.0633 1.0630 1.0959 1.1005 1.0990 1.0959 1.0929 1.0847 1.0847 1.0880 1.0880 1.0936 1.0927 1.0949 1.0973 1.1009 1.0975
irintensity: 0.5505 0.0574 0.1617 0.2759 0.3625 1.1931 0.2492 1.0093 1.3211 1.5168 0.6240 0.5175 2.9293 1.5861 1.4376 1.2898 1.5727 1.5988 0.2117 0.0725 0.1001 1.4396 2.2560 5.2485 39.9289 13.4314 12.4782 0.5027 10.2019 5.4274 5.0965 48.2947 59.9662 8.9603 18.5903 38.6932 14.4098 2.9149 2.0063 0.4196 1.0610 8.6903 16.7326 5.6916 16.5668 30.2696 14.4973 0.1787 0.6427 1.6061 1.2159 0.6170 0.4961 3.2617 6.8192 9.1904 12.6376 7.6016 9.9246 7.3044 17.0097 2.5687 11.6315 1.9465 0.0954 0.1797 3.1502 3.4444 1.3017 4.6479 6.0959 10.1455 3.0471 9.5416 1.6468 1.9205 4.4506 5.0974 0.8235 0.5566 1.0987 0.6088 16.4893 4.8129 7.3013 17.3861 6.3668 17.3928 31.2604 17.1746 2.8790 0.5378 9.1746 2.8252 70.9298 34.0983 25.6670 17.7579 8.1508 48.8359 31.6792 40.6541 9.2258 18.4450 1.6632 0.7743 2.6418 5.4381 26.6861 13.2630 26.6655 39.5917 22.3629 8.4099
temp: 298.150 k
press: 1.00000 atm
elementType: 35 8 6 6 6 6 6 6 6 6 6 6 6 6 6 6 6 6 6 6 6 1 1 1 1 1 1 1 1 1 1 1 1 1 1 1 1 1 1 1
symmnumber: 1
zpe: 853592.4 jmol-1
zpe.correction: 0.325116 hartree
zpe.thermalcorrener: 0.343658 hartree
zpe.thermalcorrenthalpy: 0.344602 hartree
zpe.thermalcorrgfe: 0.277019 hartree
zpe.sumelectzpe: -822.587491 hartree
zpe.sumelectthermal: -822.568949 hartree
zpe.sumelectthermalent: -822.568005 hartree
zpe.sumelectthermalfe: -822.635588 hartree
dipole: -1.8705 -0.2212 4.0549
dipole: 4.4710
quadrupole: -136.2659 -119.1547 -131.1026
quadrupole: -2.2420 5.5732 -1.1150
quadrupole: -7.4249 9.6864 -2.2615 -2.2420 5.5732 -1.1150
hfenergy: -822.9126075 hartree
pointgroup: C01 [X(C19H19Br1O1)]
dipole: 0.1865987 -0.3140981 1.7206818 debye
polarizability: 238.7144723|-1.9959745|217.8202594|-2.9663341|-9.8202025|183.6974801 unknown
InChI: InChI=1S/C19H19BrO/c20-17-13-7-8-14-19(18(17)21,15-9-3-1-4-10-15)16-11-5-2-6-12-16/h1-6,9-12,17H,7-8,13-14H2
charge 0 multiplicity 1
40 atoms
Br -1.310973 3.58866 -1.889519
O  0.489815 1.038996 -1.981623
C  0.112776 0.153235 0.294966
C  0.453837 0.750825 1.706202
C  1.704448 1.667828 1.75789
C  1.384764 3.161901 1.501882
C  0.123351 1.263361 -0.804843
C  -0.343014 2.659624 -0.359298
C  0.866584 3.519896 0.083593
C  -1.344525 -0.400524 0.223137
C  1.132639 -0.978659 0.001479
C  -1.81688 -0.905318 -1.019405
C  0.883389 -2.276124 0.520698
C  -2.210428 -0.452179 1.344508
C  2.366437 -0.747979 -0.660075
C  -3.115885 -1.438599 -1.138018
C  1.833221 -3.311441 0.386099
C  -3.513829 -0.989945 1.226686
C  3.317176 -1.784108 -0.799269
C  -3.974322 -1.481444 -0.01403
C  3.058635 -3.070409 -0.276044
H  0.590506 -0.108359 2.388121
H  -0.405557 1.326653 2.101465
H  2.477454 1.307483 1.052047
H  2.155598 1.588561 2.765523
H  0.633454 3.491967 2.248765
H  2.294246 3.766369 1.685955
H  -1.110163 2.603033 0.429294
H  0.557751 4.580319 0.080482
H  1.668035 3.415291 -0.671805
H  -1.156974 -0.878118 -1.893778
H  -0.066575 -2.481786 1.026967
H  -1.879762 -0.094501 2.324032
H  2.581341 0.228029 -1.103325
H  -3.459138 -1.817123 -2.107075
H  1.614065 -4.305099 0.793281
H  -4.165391 -1.025714 2.107216
H  4.258308 -1.584688 -1.324142
H  -4.98565 -1.893034 -0.104815
H  3.795936 -3.873282 -0.387919
