program: Gaussian 09
title: 000272892
version: EM64L-G09RevD.01
frameworkgroup: C1[X(C20H27N3O6)]
method: RPBEPBE
basis: SDD
operation: Freq
keyword: #p
keyword: freq=noraman
keyword: PBEPBE/SDD
title: #p freq=noraman PBEPBE/SDD
converged: NO YES NO NO
title: Mulliken charges:
elementType: O O O O O O N N N C C C C C C C C C C C C C C C C C C C C H H H H H H H H H H H H H H H H H H H H H H H H H H H
charge: -0.270682 -0.214422 -0.315310 -0.455359 -0.466288 -0.329973 -0.210126 -0.041921 -0.618673 0.278031 -0.100105 -0.103248 -0.100168 -0.533254 -0.519627 -0.524173 -0.448819 -0.448078 -0.450161 0.151971 -0.367067 -0.059493 -0.112819 -0.206421 -0.043700 -0.071634 0.115115 -0.344335 0.191152 0.201710 0.205927 0.201151 0.225001 0.218489 0.214027 0.222836 0.204222 0.229359 0.197625 0.198531 0.197896 0.195335 0.198620 0.197658 0.232564 0.254665 0.296799 0.240920 0.235760 0.277315 0.375694 0.393195 0.299852 0.236304 0.344936 0.323194
chargesum: 0.00000
title: Mulliken charges with hydrogens summed into heavy atoms:
elementType: O O O O O O N N N C C C C C C C C C C C C C C C C C C C C
charge: -0.270682 -0.214422 -0.315310 -0.079665 -0.073093 -0.329973 -0.210126 -0.041921 0.049456 0.278031 0.101605 0.102679 0.100983 -0.089763 -0.082764 -0.090592 -0.052663 -0.054847 -0.053883 0.151971 0.120162 0.237306 0.128101 0.029339 0.233615 0.228219 0.115115 -0.108031 0.191152
polarizability: 3.27795189e+02 -2.69709880e+01 2.43437389e+02 1.86895665e+01 1.87094254e+00 1.80185976e+02
1716.lowfreq: -5.4798 0.0003 0.0008 0.0011 5.3333 9.0193 16.2668 22.1023 33.7589
frequency: 14.7547 21.2841 29.6724 42.4402 45.1254 51.2469 66.1256 91.7597 119.0964 132.6416 169.4400 183.1193 204.9988 218.1667 227.6293 255.8816 271.5193 288.3452 297.4950 302.8950 322.0804 333.9504 340.5514 360.3002 377.8844 390.1012 396.9595 412.3127 423.2311 426.9336 437.0361 455.3303 463.9180 468.7389 497.8190 526.5582 539.0842 560.4264 573.6408 575.9519 609.5110 641.0328 642.1820 643.8483 665.5367 695.4775 695.5044 716.0668 726.0229 746.7748 750.5954 765.5313 784.1157 807.7081 816.3126 816.4654 841.2492 844.1363 855.8558 873.0042 876.2559 878.8510 902.7892 916.5464 932.9792 937.9670 942.2679 949.8789 970.0351 973.4986 975.7442 981.5362 982.5491 1014.9695 1024.9130 1029.0658 1041.2440 1042.5551 1052.1543 1053.3837 1065.8288 1072.5297 1093.1597 1102.5680 1103.9065 1104.7162 1108.5523 1110.4350 1113.5214 1166.0634 1172.3404 1180.5530 1190.9792 1193.8424 1222.9080 1225.0986 1249.3002 1251.1926 1252.5273 1262.0832 1268.0168 1285.0353 1286.9527 1290.5519 1291.6617 1306.4943 1308.2563 1309.8128 1314.0112 1314.8344 1325.0537 1333.0452 1339.8798 1342.4690 1342.9150 1352.8092 1357.5278 1360.1040 1360.5921 1364.5153 1391.3402 1405.9872 1452.9725 1453.2425 1455.2247 1463.6046 1466.5973 1469.2536 1475.1087 1486.2500 1504.8046 1579.1206 1627.0715 1627.1821 1639.1753 2964.8036 2966.5494 2967.7386 2975.4356 2978.4599 2979.9809 2986.5090 2996.3824 2999.7714 3006.5519 3009.0901 3010.2746 3022.5959 3024.0519 3030.9373 3031.7313 3043.1977 3050.0994 3050.9817 3074.2061 3108.9954 3117.1417 3178.9498 3201.5684 3401.9570 3540.1765 3696.8395
redmass: 6.5210 5.7492 4.2939 5.4385 7.8993 6.6050 5.0904 7.5405 4.6552 4.5079 6.2309 5.8110 5.8199 6.1816 5.3862 6.7780 3.9582 5.0455 1.9826 3.6771 5.1817 2.3386 3.6984 3.3717 3.5808 4.1513 4.7656 2.8866 2.1404 1.7585 3.0282 1.1647 3.3069 1.9493 5.4034 4.7320 5.1946 1.2221 6.8218 1.2681 6.4190 3.9255 5.1906 3.9201 4.2918 3.1941 7.5913 5.3362 5.9972 6.3205 6.9526 3.9937 1.7488 2.7633 1.2181 2.3492 3.6023 4.0996 4.1054 1.5844 1.5562 1.5594 3.0609 2.9389 2.9561 3.0448 2.1527 2.7144 2.2644 1.3458 2.3111 2.8907 3.2354 4.9291 5.5175 2.3684 4.3340 1.9150 1.7464 1.8035 4.5665 2.1642 2.9104 1.5306 1.3661 1.3741 1.9659 1.0495 1.0230 3.3061 1.9244 1.2124 1.3156 1.4222 2.5288 1.5887 1.2904 1.4815 1.2932 1.7399 1.3674 1.7594 1.2082 1.8413 1.8662 2.0346 1.2392 1.3287 1.5922 1.5150 1.3165 1.3221 1.3493 1.4537 1.4789 1.4299 1.5609 1.4751 1.3923 2.0237 1.7238 1.5802 1.0981 1.0846 1.0814 1.0905 1.0911 1.0918 4.6165 1.0897 4.3810 2.8773 5.0613 2.1579 5.8262 1.0638 1.0610 1.0615 1.0630 1.0628 1.0837 1.0647 1.0821 1.0807 1.0857 1.0864 1.0822 1.1028 1.1029 1.1014 1.0576 1.1018 1.1013 1.1016 1.0877 1.1082 1.0668 1.0898 1.0992 1.0640 1.0455 1.1045
irintensity: 0.5847 0.7324 2.0729 0.9780 2.3451 1.2428 0.6409 3.4797 0.8280 0.2241 17.6130 0.3981 6.5014 7.2000 2.7369 6.2645 8.4592 14.0648 0.0598 2.7623 4.4894 0.4568 23.9908 3.4623 3.3697 12.8707 0.1107 7.0994 2.7229 0.5119 3.3514 141.5427 44.0650 0.5776 1.9462 7.9005 8.3753 148.4368 17.3785 143.6061 6.1523 1.3524 13.7743 1.5818 8.2399 0.5075 5.5625 19.0214 6.8446 2.6543 6.2336 4.1871 70.3793 3.0939 110.9301 12.0124 5.4761 28.6173 8.4779 0.1089 0.6889 0.1478 19.2372 19.5623 0.6938 4.9899 0.2158 26.8635 5.2731 10.7474 10.3466 78.7891 104.2723 147.0561 306.4270 33.0740 59.5038 0.6082 0.3178 0.7969 48.5779 44.7300 23.2663 10.0690 5.4048 1.7137 24.7878 1.6835 0.2537 237.6007 20.2378 0.8650 47.0874 12.7093 57.5187 1.3835 9.1843 2.1761 92.4900 1.5927 72.1481 0.3246 11.0951 0.3418 0.4612 1.6509 1.9775 0.8217 0.0771 0.6853 0.0040 68.5225 45.8286 3.9047 3.8338 0.7355 0.2878 7.4991 8.2120 15.6297 16.8487 538.9756 7.2763 2.5113 0.3078 17.6905 19.7019 27.8721 79.1053 0.0563 115.7424 128.1271 183.5070 74.1119 813.5103 23.2221 26.1157 25.8948 9.6437 25.2148 13.1512 42.2547 150.5861 129.7547 5.9029 89.9955 34.2788 11.6733 12.1102 110.3903 21.4283 0.9378 48.2702 41.5794 13.7235 12.5877 665.5675 1.9051 9.0237 57.7069 134.2539 42.2406
temp: 298.150 k
press: 1.00000 atm
elementType: 8 8 8 8 8 8 7 7 7 6 6 6 6 6 6 6 6 6 6 6 6 6 6 6 6 6 6 6 6 1 1 1 1 1 1 1 1 1 1 1 1 1 1 1 1 1 1 1 1 1 1 1 1 1 1 1
symmnumber: 1
zpe: 1207876.1 jmol-1
zpe.correction: 0.460056 hartree
zpe.thermalcorrener: 0.485054 hartree
zpe.thermalcorrenthalpy: 0.485998 hartree
zpe.thermalcorrgfe: 0.403629 hartree
zpe.sumelectzpe: -1391.757777 hartree
zpe.sumelectthermal: -1391.732779 hartree
zpe.sumelectthermalent: -1391.731834 hartree
zpe.sumelectthermalfe: -1391.814204 hartree
dipole: 0.9324 -6.2313 2.3173
dipole: 6.7133
quadrupole: -136.7956 -170.9918 -177.9214
quadrupole: -42.0666 -2.2317 -7.1597
quadrupole: 25.1073 -9.0888 -16.0185 -42.0666 -2.2317 -7.1597
hfenergy: -1392.2178327 hartree
pointgroup: C01 [X(C20H27N3O6)]
dipole: 0.1342319 -0.9800968 -2.448953 debye
polarizability: 313.437504|10.5997581|212.1376561|45.29781|37.1464514|225.8433943 unknown
InChI: InChI=1S/C20H27N3O6/c21-14-1-2-23(19(27)22-14)17-16(25)15(24)13(29-17)9-28-18(26)20-6-10-3-11(7-20)5-12(4-10)8-20/h1-2,10-13,15-17,24-25H,3-9,21H2
charge 0 multiplicity 1
56 atoms
O  1.3748 -0.10349 -0.492425
O  2.193137 -2.197927 0.112125
O  -2.047012 -1.447527 0.306028
O  -1.275121 0.693075 2.510115
O  -3.308619 1.827881 1.304322
O  -5.518656 0.870446 0.285256
N  -4.173815 -0.834345 -0.595811
N  -6.379818 -0.392113 -1.487831
N  -7.210328 -1.640763 -3.256806
C  3.690363 -0.215885 0.232393
C  6.12077 -0.467194 0.933888
C  4.79556 1.556731 1.691346
C  5.471884 1.320014 -0.74279
C  4.800393 -1.226064 0.641653
C  3.468153 0.807266 1.398686
C  4.146389 0.569455 -1.041867
C  5.894766 0.536532 2.096207
C  6.571413 0.300392 -0.338227
C  5.246435 2.32491 0.419444
C  2.393256 -0.9713 -0.036796
C  0.0472 -0.724049 -0.727785
C  -0.767506 -0.706081 0.577027
C  -1.17548 0.695151 1.056265
C  -2.592134 0.905553 0.453127
C  -3.176905 -0.542945 0.482015
C  -3.982246 -1.849838 -1.507465
C  -5.40603 -0.067837 -0.576156
C  -4.957135 -2.157376 -2.439108
C  -6.178613 -1.388382 -2.386435
H  6.900114 -1.19974 1.221858
H  4.62496 2.272713 2.519189
H  5.785696 1.867637 -1.653425
H  4.475243 -1.794635 1.533269
H  4.949663 -1.964853 -0.168899
H  3.125407 0.271236 2.305826
H  2.674092 1.523856 1.117026
H  4.291992 -0.137918 -1.882741
H  3.356423 1.283253 -1.339877
H  6.838265 1.069768 2.328318
H  5.590913 -0.006676 3.013397
H  7.525864 0.829929 -0.145452
H  6.754562 -0.41292 -1.167155
H  6.183018 2.880589 0.624837
H  4.478037 3.070873 0.1332
H  -0.417727 -0.108848 -1.515646
H  0.177479 -1.765449 -1.068692
H  -0.236318 -1.249865 1.375198
H  -0.460824 1.468179 0.713617
H  -2.534751 1.261945 -0.59625
H  -3.670866 -0.721339 1.457843
H  -2.034104 1.311325 2.721216
H  -4.291031 1.683638 1.085193
H  -3.032387 -2.381324 -1.426493
H  -4.801218 -2.962899 -3.158775
H  -8.05386 -1.07518 -3.171325
H  -7.153643 -2.369185 -3.963248
