program: Gaussian 09
title: 000272834
version: EM64L-G09RevD.01
frameworkgroup: C1[X(C17H20O2)]
method: RPBEPBE
basis: SDD
operation: Freq
keyword: #pfreq=noraman
keyword: PBEPBE/SDD
title: #p freq=noraman PBEPBE/SDD
converged: NO YES NO NO
title: Mulliken charges:
elementType: O O C C C C C C C C C C C C C C C C C H H H H H H H H H H H H H H H H H H H H
charge: -0.438916 -0.438533 0.076411 -0.391556 0.495806 0.470771 -0.788975 -0.390265 -0.565456 -0.566770 -0.462548 -0.455234 -0.697819 0.286827 0.283785 -0.209504 -0.207813 -0.382420 -0.381780 0.200608 0.185571 0.230450 0.235437 0.213717 0.194824 0.228241 0.243288 0.240716 0.246922 0.246854 0.207130 0.219655 0.209194 0.223809 0.224304 0.252316 0.252181 0.354271 0.354499
chargesum: 0.00000
title: Mulliken charges with hydrogens summed into heavy atoms:
elementType: O O C C C C C C C C C C C C C C C C C
charge: -0.084645 -0.084033 0.076411 -0.005376 0.495806 0.470771 -0.109371 0.032801 -0.322169 -0.326054 -0.215626 -0.208380 -0.061840 0.286827 0.283785 0.014305 0.016491 -0.130104 -0.129599
polarizability: 2.03151646e+02 9.72828427e+00 1.91895005e+02 -1.94681446e+01 -9.40505117e+00 1.62995177e+02
1716.lowfreq: -10.9928 -8.3939 -6.0441 -0.0005 0.0005 0.0010 26.3284 33.3764 44.1875
frequency: 25.5666 33.2451 44.0581 51.3942 71.2055 95.4365 158.3646 185.5281 209.2895 223.4148 224.7556 229.3116 275.7253 280.4408 285.3368 298.8524 305.5566 323.0216 364.3723 376.4925 385.5143 423.3095 442.1671 453.0129 479.5793 517.5801 523.2908 537.5360 597.7976 623.8958 642.0389 680.1497 703.8960 708.3601 740.6427 754.8912 793.7663 798.1601 836.2606 866.6970 868.0027 875.0856 891.3981 894.3026 907.5482 913.2457 950.7101 971.8907 974.2833 985.9388 986.3596 1011.0426 1042.0185 1057.6132 1078.3459 1083.5900 1107.1652 1113.2692 1142.2737 1148.1588 1150.3605 1175.9194 1178.6901 1186.7724 1198.5715 1241.7449 1261.5328 1266.3388 1288.9839 1304.5728 1315.9607 1317.2206 1344.7617 1382.9082 1386.4399 1387.6088 1389.1602 1426.4592 1430.2319 1461.6179 1472.4346 1476.2928 1476.7459 1481.6005 1488.5691 1493.8669 1494.6174 1604.5232 1607.8865 1608.5508 1611.8067 2962.2515 2971.1054 2982.8834 2986.1920 3013.8232 3039.7469 3069.8975 3072.9346 3081.2747 3084.1237 3102.6209 3103.0813 3133.2235 3133.6547 3165.0747 3165.4587 3175.9724 3176.3174 3577.8588 3579.2643
redmass: 3.3917 3.4478 2.6669 4.9265 3.2440 3.6367 2.4671 4.1625 4.4432 3.7235 1.9265 1.7517 3.0769 2.2586 2.0451 2.4713 3.0771 2.5202 1.1226 1.1270 3.4413 3.7075 3.2608 2.9391 3.3968 7.2118 7.1394 3.5598 4.5620 4.3341 4.7286 5.1530 2.1123 2.0451 1.2631 2.5610 1.4783 1.4905 2.9772 1.5628 1.6031 1.5885 1.4294 1.4934 2.0889 2.2967 1.9720 1.3282 1.3251 6.1065 6.1727 1.8174 1.8314 2.2851 1.7156 1.6798 2.0812 1.6730 1.4830 1.4475 3.0123 1.1377 1.1092 1.8151 1.7982 1.4864 2.4740 1.9289 1.5340 1.2647 1.3419 1.3419 1.5196 6.0562 1.2342 5.9140 1.3047 2.8338 2.8312 1.0913 1.0738 1.0749 1.0442 1.0665 1.0869 2.2898 2.3751 6.1784 6.3737 6.2513 6.4492 1.0579 1.0361 1.0516 1.0443 1.0987 1.1017 1.1016 1.0990 1.0995 1.0996 1.0906 1.0909 1.0875 1.0874 1.0914 1.0916 1.0976 1.0976 1.0659 1.0659
irintensity: 0.3011 0.1322 0.0129 0.1796 0.1130 0.1096 0.0470 0.7197 0.6652 0.5739 0.2687 0.2774 0.1465 0.3619 0.5558 0.1187 0.4289 0.3391 158.7994 100.3625 6.0513 21.7852 5.4764 4.4370 25.1311 1.6592 0.8360 4.9615 0.2273 0.1789 0.6424 0.4558 31.2895 33.7840 4.7638 32.3750 30.1963 23.8467 15.6512 19.3015 3.7706 18.6546 4.0199 6.3359 3.3487 28.3578 21.8753 0.5118 1.7187 3.2175 2.8505 2.0363 6.8136 9.3887 13.6624 24.2732 27.5995 69.8268 163.1668 159.7804 1.4354 0.3941 1.1897 18.5814 16.9519 4.9038 18.6004 10.8198 11.6375 9.9553 4.4950 8.7087 4.8646 3.3617 8.3542 0.9619 12.9855 64.8515 57.2526 2.7452 0.7131 0.8455 16.3074 12.9150 16.9106 22.3090 12.2600 84.4347 51.9567 92.2405 19.5749 18.8946 47.5588 12.7711 37.2516 10.0439 11.3013 80.9684 42.1922 44.0062 30.3315 4.9488 16.6605 13.5111 10.8415 10.0153 12.3392 16.5893 6.8097 29.6020 29.3329
temp: 298.150 k
press: 1.00000 atm
elementType: 8 8 6 6 6 6 6 6 6 6 6 6 6 6 6 6 6 6 6 1 1 1 1 1 1 1 1 1 1 1 1 1 1 1 1 1 1 1 1
symmnumber: 1
zpe: 849717.5 jmol-1
zpe.correction: 0.323640 hartree
zpe.thermalcorrener: 0.342337 hartree
zpe.thermalcorrenthalpy: 0.343282 hartree
zpe.thermalcorrgfe: 0.276211 hartree
zpe.sumelectzpe: -808.851375 hartree
zpe.sumelectthermal: -808.832678 hartree
zpe.sumelectthermalent: -808.831734 hartree
zpe.sumelectthermalfe: -808.898805 hartree
dipole: -0.6589 1.2520 0.4102
dipole: 1.4730
quadrupole: -124.9334 -113.6999 -105.1260
quadrupole: -0.4667 -5.1618 -5.8941
quadrupole: -10.3470 0.8865 9.4604 -0.4667 -5.1618 -5.8941
hfenergy: -809.1750157 hartree
pointgroup: C01[X(C17H20O2)]
dipole: 0.2022174 0.5146561 -0.173503 debye
polarizability: 203.3492574|-8.2972449|190.1930981|-21.8035437|7.5176194|164.4994728 unknown
InChI: InChI=1S/C17H20O2/c1-3-10-17(2,13-6-4-8-15(18)11-13)14-7-5-9-16(19)12-14/h4-9,11-12,18-19H,3,10H2,1-2H3
charge 0 multiplicity 1
39 atoms
O  -3.745936 -2.22645 -0.505134
O  2.289613 -2.601307 2.074921
C  0.074632 1.042017 -0.585333
C  0.675218 2.225917 0.254668
C  -1.316702 0.612944 -0.038968
C  1.052274 -0.157798 -0.50916
C  -0.157297 1.526791 -2.048244
C  2.107485 2.66399 -0.127076
C  -1.874998 -0.611054 -0.494448
C  1.206365 -0.8300 0.732722
C  -2.087446 1.415406 0.839259
C  1.828641 -0.594876 -1.609864
C  2.602875 3.828749 0.758451
C  -3.161491 -1.017635 -0.080233
C  2.112353 -1.904112 0.864532
C  -3.378521 0.998782 1.247358
C  2.736639 -1.673396 -1.467573
C  -3.929251 -0.214774 0.794535
C  2.890199 -2.336105 -0.235291
H  0.671652 1.942422 1.326951
H  0.004906 3.103724 0.155458
H  -0.561589 0.71722 -2.681299
H  -0.893038 2.350304 -2.048064
H  0.771067 1.900374 -2.514611
H  2.141939 2.977498 -1.188904
H  2.799426 1.80634 -0.030017
H  -1.285829 -1.254797 -1.162344
H  0.593877 -0.520645 1.591045
H  -1.695698 2.364529 1.213819
H  1.736154 -0.10268 -2.58184
H  1.948828 4.715843 0.657994
H  3.629109 4.133266 0.483034
H  2.612918 3.538515 1.826264
H  -3.961012 1.630548 1.927492
H  3.330267 -1.999285 -2.329152
H  -4.92353 -0.552665 1.100297
H  3.583438 -3.172239 -0.106528
H  -3.130361 -2.72258 -1.100263
H  1.691124 -2.24298 2.776847
