program: Gaussian 09
title: 000272849
version: EM64L-G09RevD.01
frameworkgroup: C1[X(C20H20N2O2S)]
method: RPBEPBE
basis: SDD
operation: Freq
keyword: #p
keyword: freq=noraman
keyword: PBEPBE/SDD
title: #p freq=noraman PBEPBE/SDD
converged: YES YES NO NO
title: Mulliken charges:
elementType: S O O N N C C C C C C C C C C C C C C C C C C C C H H H H H H H H H H H H H H H H H H H H
charge: 0.190861 -0.174629 -0.258366 -0.093274 -0.387967 -0.491324 0.266703 0.121679 -0.393591 0.572148 -0.651642 -0.751257 -0.363648 -0.418060 0.208646 -0.230262 -0.222658 -0.649441 -0.237921 0.427327 -0.364523 -0.417907 -0.232575 -0.219770 -0.246555 0.250608 0.266225 0.289185 0.273197 0.233003 0.292472 0.229141 0.338984 0.238918 0.260803 0.228116 0.229537 0.234886 0.250819 0.231383 0.248571 0.234868 0.230268 0.227513 0.229507
chargesum: 0.00000
title: Mulliken charges with hydrogens summed into heavy atoms:
elementType: S O O N N C C C C C C C C C C C C C C C C C C C C
charge: 0.190861 -0.174629 -0.258366 -0.093274 -0.048983 -0.491324 0.266703 0.121679 0.123242 0.572148 -0.089261 0.003360 -0.124731 -0.157256 0.208646 -0.002146 0.006879 -0.163736 -0.006538 0.427327 -0.115952 -0.183039 -0.002307 0.007743 -0.017048
polarizability: 2.62993255e+02 -1.63844180e+01 2.22733149e+02 1.42080588e+01 -1.24233674e+00 2.30048070e+02
1716.lowfreq: -2.5988 -0.0012 -0.0012 0.0009 3.1200 9.3671 13.1129 22.5058 30.1089
frequency: 10.9726 22.4638 30.0021 37.7515 39.7933 64.5043 66.5154 79.0376 95.8245 134.9740 137.8090 189.4042 197.4185 217.5668 221.5991 238.7370 258.1323 270.7924 279.6577 306.4453 322.3755 341.6739 363.7640 377.1775 401.4839 401.8577 441.2960 464.3775 495.8834 524.5215 541.7535 574.1029 614.2761 615.8555 622.2675 635.7930 639.6206 665.0657 696.7046 704.3097 706.0291 718.7966 735.5221 754.9614 762.0552 782.0140 818.8954 826.8486 853.3348 857.0610 857.4062 877.6076 912.8110 919.0126 931.4107 936.5062 938.8159 956.0166 979.4748 981.4259 982.9767 988.9116 989.7464 990.8866 997.2410 999.4979 1026.8251 1028.1789 1054.5034 1081.2019 1084.9521 1106.6238 1144.4014 1151.8221 1171.7066 1173.2941 1178.0806 1186.7367 1189.7809 1198.3602 1212.8043 1222.7959 1245.5942 1258.2613 1278.5594 1288.0198 1294.9550 1314.7419 1327.1804 1329.4240 1380.0999 1380.3829 1390.1800 1434.9335 1439.0285 1449.6265 1450.5048 1453.5009 1456.1721 1472.9635 1481.4821 1484.0612 1486.8064 1590.3773 1590.4279 1611.6384 1613.0108 1623.7888 1725.1846 3001.7541 3001.9160 3030.8233 3044.4768 3069.2906 3097.5156 3097.9153 3118.1746 3120.3278 3121.9309 3125.5704 3128.3605 3128.7707 3133.8824 3140.9334 3145.6166 3151.1687 3163.0105 3166.1743 3363.8911
redmass: 5.4399 4.1538 4.5561 4.1349 6.5945 6.7258 4.3888 6.0705 4.5281 4.5237 5.1933 3.6698 5.2093 1.4119 3.7291 3.2883 3.3787 4.8546 3.5639 2.5032 3.7168 5.7523 4.4239 5.8539 2.8130 2.8592 4.9367 5.2030 3.9542 4.1387 4.1548 4.5863 5.8289 5.9911 5.0971 6.2295 3.8025 3.5737 4.9473 2.1344 1.8891 1.9886 1.2361 2.2324 2.7697 2.7792 4.0709 3.3854 2.3368 1.2576 1.3466 3.2538 1.7289 2.4592 2.2591 2.0454 2.2377 3.7840 1.3986 1.8940 1.7057 3.2206 5.6399 2.6622 1.3464 1.3290 2.2039 2.0122 1.7421 1.6007 1.5775 1.9144 1.4550 2.2989 1.1151 1.0546 1.5537 1.1328 1.1270 2.4398 2.3344 2.0725 1.9465 3.2778 2.2324 2.5445 1.6460 1.3438 1.2521 1.2763 8.0181 8.0679 1.2020 2.2388 2.0502 1.1405 1.0922 1.1017 1.0891 1.1748 2.0282 2.2827 1.5081 6.0385 6.2180 6.1191 6.0963 6.6246 12.2133 1.0456 1.0530 1.0587 1.0576 1.0980 1.0992 1.1061 1.0863 1.0875 1.0867 1.0999 1.1102 1.0869 1.0915 1.0916 1.0961 1.0960 1.1015 1.1015 1.0774
irintensity: 0.0699 0.1584 0.2159 0.1800 0.8475 4.0280 1.8022 1.6120 1.5283 1.5759 3.6166 0.9238 2.9648 0.2833 0.2494 1.1114 0.6322 8.6142 2.0438 1.4313 3.9824 2.4528 4.0865 17.5313 0.0864 0.1252 1.6095 3.0172 3.1342 42.7973 0.5155 25.0562 1.4496 2.6011 5.2643 17.1951 0.4073 2.3546 3.1172 27.3277 69.5054 18.7042 67.1153 51.2817 17.3781 6.3560 28.5698 6.3474 28.6681 0.3671 4.1973 8.4518 4.0495 2.5073 2.8138 5.6206 0.3936 6.7585 0.4211 15.0606 9.6518 14.8118 0.6056 9.0799 2.2993 0.1261 4.7692 8.1251 35.8374 10.4138 9.5415 8.5429 3.1996 3.7153 2.2645 0.4634 24.4571 2.0855 1.5982 11.0542 0.5679 6.0013 39.1565 104.1658 26.6003 48.6800 7.3311 2.6963 8.1982 0.6810 0.7926 0.6715 35.9886 11.1848 4.5930 95.9599 44.2293 15.9773 15.8409 212.7252 69.1904 15.6710 128.8676 7.3888 0.9320 53.8414 4.6458 168.4095 355.3648 10.2901 22.0113 24.1638 19.6996 3.8682 15.1368 3.2666 6.2774 0.7873 6.9669 0.9579 7.9846 0.5398 10.4486 14.2682 31.7159 25.3875 20.6142 24.1092 109.1273
temp: 298.150 k
press: 1.00000 atm
elementType: 16 8 8 7 7 6 6 6 6 6 6 6 6 6 6 6 6 6 6 6 6 6 6 6 6 1 1 1 1 1 1 1 1 1 1 1 1 1 1 1 1 1 1 1 1
symmnumber: 1
zpe: 931970.5 jmol-1
zpe.correction: 0.354969 hartree
zpe.thermalcorrener: 0.377751 hartree
zpe.thermalcorrenthalpy: 0.378695 hartree
zpe.thermalcorrgfe: 0.299697 hartree
zpe.sumelectzpe: -1430.358203 hartree
zpe.sumelectthermal: -1430.335421 hartree
zpe.sumelectthermalent: -1430.334477 hartree
zpe.sumelectthermalfe: -1430.413475 hartree
dipole: -1.7578 -5.4977 -2.0857
dipole: 6.1371
quadrupole: -140.1062 -162.0001 -150.3909
quadrupole: -7.7791 -2.3020 -13.8120
quadrupole: 10.7262 -11.1677 0.4415 -7.7791 -2.3020 -13.8120
hfenergy: -1430.7131717 hartree
pointgroup: C01 [X(C20H20N2O2S1)]
dipole: 0.7469738 -1.9021691 1.2859767 debye
polarizability: 264.0187677|19.2933|223.5919172|8.127009|1.8460992|228.163789 unknown
InChI: InChI=1S/C20H20N2O2S/c1-19(21-17(23)14-15-8-4-2-5-9-15)18(24)22-12-13-25-20(19,22)16-10-6-3-7-11-16/h2-11,21H,12-14H2,1H3
charge 0 multiplicity 1
45 atoms
S  0.292843 -1.511609 0.910821
O  -0.357448 0.118096 -3.135513
O  -1.338027 3.294159 -1.040561
N  1.190765 -0.941566 -1.595165
N  -0.69024 1.238697 -0.089646
C  1.335154 -0.32374 -0.254968
C  0.550579 0.979365 -0.813938
C  0.328909 0.076815 -2.101734
C  0.95932 -2.392873 -1.643863
C  2.726454 -0.152194 0.303561
C  -0.090775 -2.696471 -0.535633
C  1.424859 2.218718 -1.034608
C  2.908898 0.319637 1.628615
C  3.862848 -0.41283 -0.50008
C  -1.559791 2.305169 -0.283538
C  4.206879 0.517438 2.143703
C  5.163431 -0.220618 0.018515
C  -2.854773 2.228975 0.565453
C  5.340403 0.245089 1.340732
C  -3.407576 0.832768 0.810993
C  -3.888491 0.053005 -0.276129
C  -3.451919 0.277371 2.114589
C  -4.40136 -1.244659 -0.061895
C  -3.965375 -1.022266 2.333262
C  -4.442177 -1.787681 1.245333
H  1.902592 -2.9304 -1.449292
H  0.581981 -2.666794 -2.643454
H  -1.117982 -2.501987 -0.880838
H  -0.002762 -3.722927 -0.146999
H  2.356373 1.942688 -1.556114
H  0.867219 2.959946 -1.626605
H  1.6918 2.675265 -0.065148
H  -1.032835 0.44082 0.468105
H  2.035715 0.51828 2.261885
H  3.720271 -0.756365 -1.530568
H  4.336607 0.880015 3.169433
H  6.03594 -0.43033 -0.610349
H  -2.645647 2.735581 1.527487
H  -3.584023 2.859134 0.027045
H  6.348545 0.395098 1.742553
H  -3.858446 0.468329 -1.291212
H  -3.08722 0.867051 2.964909
H  -4.776583 -1.828606 -0.910173
H  -3.994996 -1.433139 3.348709
H  -4.845738 -2.792653 1.412921
